{"text_format":"1","workbook":"xlsx","n_sheets":4,"sheets":["bestelbon alg.","bon 1 met nr","finaal","produkten"],"not_rendered":{"charts":0,"images":1,"macros":1,"external_links":1,"defined_names":3,"comments":0,"pivot_tables":0},"unopened":[],"bounds":{"document_bytes":16777216,"sheet_cells":100000,"rows_first":2000,"rows_last":500,"rows_between":2000,"halvings":0,"cell_chars":16384,"cell_head_chars":4096},"cells_cut":0,"cells_raw":0,"read":"whole","date_system":"1900"}

{"sheet":"bestelbon alg.","index":0,"n_rows":133,"n_cols":10,"rows_kept":133,"cut":false,"hidden":false,"merged":[[0,9,1,9],[66,9,67,9],[125,0,126,3],[127,0,129,3],[130,0,132,3],[77,3,78,3],[8,7,8,9],[74,7,74,9],[77,0,78,1],[77,2,78,2],[37,33,37,35],[102,33,102,35],[7,5,7,6],[8,5,8,6],[73,5,73,6],[74,5,74,6]]}
[]
[]
[]
[]
[]
[]
[]
["KLANT:",null,"Datum afhaling : ",null,null,null,null,"uur/heure:"]
[null,null,"Datum levering :"]
[]
["vruchtgewas - Plants chauds",null,null,"AANTAL",null,"Bladgewas - Plants plain terre",null,null,null,"AANTAL"]
["Komkommer  -  Concombre",null,"10 cm",null,null,"Witte Selder  -  Céleri blanc",null,null,"4 cm"]
["Snack Komkommer- Concombre snack",null,"10 cm",null,null,"Groene Selder  -  Céleri vert",null,null,"4 cm"]
["Paprika rood  -  Poivron rouge",null,"10 cm",null,null,"Knolselder  -  Céleri rave",null,null,"4 cm"]
["Paprika geel  -  Poivron jaune",null,"10 cm",null,null,"Venkel  -  Fenouil",null,null,"4 cm"]
["Zoete Punt Paprika - Poivron doux allongé",null,"10 cm",null,null,"Peterselie  -  Persil",null,null,"4 cm"]
["Aubergine ",null,"10 cm",null,null,"Bladpeterselie - Persil 'Plat'",null,null,"4 cm"]
["Spaanse peper  -  Piment",null,"10 cm",null,null,"Snijselder  -  Céleri à jets",null,null,"4 cm"]
["Potpeper  -  Piment Patio",null,"10 cm",null,null,"Suikerbrood  -  Pain de sucre",null,null,"4 cm"]
["Vleestomaat - Tomate Charnue Hybride F1",null,"10 cm",null,null,"Radicchio",null,null,"4 cm"]
["Cherrytomaat - Tomate apéritif F1",null,"10 cm",null,null,"Chinese kool - Chou Chinois",null,null,"4 cm"]
["Pot tomaat - Tomate Patio",null,"10 cm",null,null,"Paksoi",null,null,"4 cm"]
["Trostomaat  -  Tomate grapes F1",null,"10 cm",null,null,"Rode Biet - Betterave rouge",null,null,"4 cm"]
["Italiaanse tomaat - Tomate Roma F1",null,"10 cm",null,null,"Koolrabi - Chou Rave",null,null,"4 cm"]
["Tomaat - Tomate 'Cœur de Bœuf'",null,"10 cm",null,null,"Lente-Ui  -  Oignons Blancs",null,null,"4 cm"]
["Snoep tomaat - Tomate Snack F1",null,"10 cm",null,null,"Rode Ui - Oignons Rouges",null,null,"4 cm"]
["Gele tomaat - Tomate jaune F1",null,"10 cm",null,null,"Bloemkool - Chou fleur F1",null,null,"4 cm"]
["Tomaat - Tomate 'Marmande'",null,"10 cm-doosje",null,null,"Spruitkool - Chou de Bruxelles F1",null,null,"4 cm"]
["Tomaat - Tomate 'Pyros' F1",null,"10 cm-doosje",null,null,"Savooikool - Chou Milan",null,null,"4 cm"]
["Tomaat - Tomate 'Saint-Pierre'",null,"10 cm-doosje",null,null,"Rode kool - Chou rouge F1",null,null,"4 cm"]
["Tomaat - Tomate 'Green Zebra'",null,"10 cm-doosje",null,null,"Witte kool - Chou blanc F1",null,null,"4 cm"]
["Tomaat - Tomate 'Noir de Crimée'",null,"10 cm-doosje",null,null,"Spitskool - Chou pointu F1",null,null,"4 cm"]
["Tomaat - Tomate 'Andine Cornue'",null,"10 cm-doosje",null,null,"Broccoli - Chou Brocoli F1",null,null,"4 cm"]
["Tomaat - Tomate 'Yellow Pear'",null,"10 cm-doosje",null,null,"Boerenkool - Chou frisé F1",null,null,"4 cm"]
["Tomaat - Tomate 'Costoluto Genovese'",null,"10 cm-doosje",null,null,"Torentjesbloemkool - Chou Romanesco",null,null,"4 cm"]
["Meloen - Melon 'Charentais'",null,"10 cm-doosje",null,null,"Andijvie  -  Scarole",null,null,"4 cm"]
["Honingmeloen - Melon miel",null,"10 cm-doosje",null,null,"Krulandijvie - Fine maraîchère",null,null,"4 cm"]
["Watermeloen - Pastèque",null,"10 cm-doosje",null,null,"Kropsla  -  Laitue",null,null,"4 cm"]
["Patisson",null,"10 cm-doosje",null,null,"Serresla - Laitue de serre",null,null,"4 cm"]
["Courgette Groen - Vert",null,"10 cm-doosje",null,null,"Sla - 5 cm (serre)",null,null,"5 cm"]
{"$rows_left_out":94}
{"sheet":"bon 1 met nr","index":1,"n_rows":206,"n_cols":9,"rows_kept":206,"cut":false,"hidden":false,"merged":[]}
["NAAM :",{"$f":"IF('bestelbon alg.'!B8:F8=\"\",\"\",'bestelbon alg.'!B8:F8)","v":""}]
["Afhaling : ",{"$f":"IF('bestelbon alg.'!F8=\"\",\"\",'bestelbon alg.'!F8)","v":""},{"$f":"IF('bestelbon alg.'!G8=\"\",\"\",'bestelbon alg.'!G8)","v":""}]
[null,"Datum levering :",{"$f":"IF('bestelbon alg.'!F9=\"\",\"\",'bestelbon alg.'!F9)","v":""}]
["uur : ",{"$f":"IF('bestelbon alg.'!J8=\"\",\"\",'bestelbon alg.'!J8)","v":""},{"$f":" \"#colli : \"&TEXT(F206,0)","v":"#colli : 0"}]
[]
[{"$f":"IF(B6=\"\",\"\",VLOOKUP(C6,produkten!$A$1:$C$201,3,FALSE))","v":""},{"$f":"IF('bestelbon alg.'!D12=\"\",\"\",IF('bestelbon alg.'!D12=0,\"\",'bestelbon alg.'!D12))","v":""},{"$f":"IF(B6=\"\",\"\",produkten!A1)","v":""},{"$f":"IF(B6=\"\",\"\",produkten!B1)","v":""},{"$f":"'bestelbon alg.'!A12","v":"Komkommer  -  Concombre"},null,null,null,{"$f":"IF(E6=C6,\"ok\",\"FOUT\")","v":"FOUT"}]
[{"$f":"IF(B7=\"\",\"\",VLOOKUP(C7,produkten!$A$1:$C$201,3,FALSE))","v":""},{"$f":"IF('bestelbon alg.'!D13=\"\",\"\",IF('bestelbon alg.'!D13=0,\"\",'bestelbon alg.'!D13))","v":""},{"$f":"IF(B7=\"\",\"\",produkten!A2)","v":""},{"$f":"IF(B7=\"\",\"\",produkten!B2)","v":""},{"$f":"'bestelbon alg.'!A13","v":"Snack Komkommer- Concombre snack"},null,null,null,{"$f":"IF(E7=C7,\"ok\",\"FOUT\")","v":"FOUT"}]
[{"$f":"IF(B8=\"\",\"\",VLOOKUP(C8,produkten!$A$1:$C$201,3,FALSE))","v":""},{"$f":"IF('bestelbon alg.'!D14=\"\",\"\",IF('bestelbon alg.'!D14=0,\"\",'bestelbon alg.'!D14))","v":""},{"$f":"IF(B8=\"\",\"\",produkten!A3)","v":""},{"$f":"IF(B8=\"\",\"\",produkten!B3)","v":""},{"$f":"'bestelbon alg.'!A14","v":"Paprika rood  -  Poivron rouge"},null,null,null,"FOUT"]
[{"$f":"IF(B9=\"\",\"\",VLOOKUP(C9,produkten!$A$1:$C$201,3,FALSE))","v":""},{"$f":"IF('bestelbon alg.'!D15=\"\",\"\",IF('bestelbon alg.'!D15=0,\"\",'bestelbon alg.'!D15))","v":""},{"$f":"IF(B9=\"\",\"\",produkten!A4)","v":""},{"$f":"IF(B9=\"\",\"\",produkten!B4)","v":""},{"$f":"'bestelbon alg.'!A15","v":"Paprika geel  -  Poivron jaune"},null,null,null,"FOUT"]
[{"$f":"IF(B10=\"\",\"\",VLOOKUP(C10,produkten!$A$1:$C$201,3,FALSE))","v":""},{"$f":"IF('bestelbon alg.'!D16=\"\",\"\",IF('bestelbon alg.'!D16=0,\"\",'bestelbon alg.'!D16))","v":""},{"$f":"IF(B10=\"\",\"\",produkten!A5)","v":""},{"$f":"IF(B10=\"\",\"\",produkten!B5)","v":""},{"$f":"'bestelbon alg.'!A16","v":"Zoete Punt Paprika - Poivron doux allongé"},null,null,null,"FOUT"]
[{"$f":"IF(B11=\"\",\"\",VLOOKUP(C11,produkten!$A$1:$C$201,3,FALSE))","v":""},{"$f":"IF('bestelbon alg.'!D17=\"\",\"\",IF('bestelbon alg.'!D17=0,\"\",'bestelbon alg.'!D17))","v":""},{"$f":"IF(B11=\"\",\"\",produkten!A6)","v":""},{"$f":"IF(B11=\"\",\"\",produkten!B6)","v":""},{"$f":"'bestelbon alg.'!A17","v":"Aubergine "},null,null,null,"FOUT"]
[{"$f":"IF(B12=\"\",\"\",VLOOKUP(C12,produkten!$A$1:$C$201,3,FALSE))","v":""},{"$f":"IF('bestelbon alg.'!D18=\"\",\"\",IF('bestelbon alg.'!D18=0,\"\",'bestelbon alg.'!D18))","v":""},{"$f":"IF(B12=\"\",\"\",produkten!A7)","v":""},{"$f":"IF(B12=\"\",\"\",produkten!B7)","v":""},{"$f":"'bestelbon alg.'!A18","v":"Spaanse peper  -  Piment"},null,null,null,"FOUT"]
[{"$f":"IF(B13=\"\",\"\",VLOOKUP(C13,produkten!$A$1:$C$201,3,FALSE))","v":""},{"$f":"IF('bestelbon alg.'!D19=\"\",\"\",IF('bestelbon alg.'!D19=0,\"\",'bestelbon alg.'!D19))","v":""},{"$f":"IF(B13=\"\",\"\",produkten!A8)","v":""},{"$f":"IF(B13=\"\",\"\",produkten!B8)","v":""},{"$f":"'bestelbon alg.'!A19","v":"Potpeper  -  Piment Patio"},null,null,null,"FOUT"]
[{"$f":"IF(B14=\"\",\"\",VLOOKUP(C14,produkten!$A$1:$C$201,3,FALSE))","v":""},{"$f":"IF('bestelbon alg.'!D20=\"\",\"\",IF('bestelbon alg.'!D20=0,\"\",'bestelbon alg.'!D20))","v":""},{"$f":"IF(B14=\"\",\"\",produkten!A9)","v":""},{"$f":"IF(B14=\"\",\"\",produkten!B9)","v":""},{"$f":"'bestelbon alg.'!A20","v":"Vleestomaat - Tomate Charnue Hybride F1"},null,null,null,"FOUT"]
[{"$f":"IF(B15=\"\",\"\",VLOOKUP(C15,produkten!$A$1:$C$201,3,FALSE))","v":""},{"$f":"IF('bestelbon alg.'!D21=\"\",\"\",IF('bestelbon alg.'!D21=0,\"\",'bestelbon alg.'!D21))","v":""},{"$f":"IF(B15=\"\",\"\",produkten!A10)","v":""},{"$f":"IF(B15=\"\",\"\",produkten!B10)","v":""},{"$f":"'bestelbon alg.'!A21","v":"Cherrytomaat - Tomate apéritif F1"},null,null,null,"FOUT"]
[{"$f":"IF(B16=\"\",\"\",VLOOKUP(C16,produkten!$A$1:$C$201,3,FALSE))","v":""},{"$f":"IF('bestelbon alg.'!D22=\"\",\"\",IF('bestelbon alg.'!D22=0,\"\",'bestelbon alg.'!D22))","v":""},{"$f":"IF(B16=\"\",\"\",produkten!A11)","v":""},{"$f":"IF(B16=\"\",\"\",produkten!B11)","v":""},{"$f":"'bestelbon alg.'!A22","v":"Pot tomaat - Tomate Patio"},null,null,null,"FOUT"]
[{"$f":"IF(B17=\"\",\"\",VLOOKUP(C17,produkten!$A$1:$C$201,3,FALSE))","v":""},{"$f":"IF('bestelbon alg.'!D23=\"\",\"\",IF('bestelbon alg.'!D23=0,\"\",'bestelbon alg.'!D23))","v":""},{"$f":"IF(B17=\"\",\"\",produkten!A12)","v":""},{"$f":"IF(B17=\"\",\"\",produkten!B12)","v":""},{"$f":"'bestelbon alg.'!A23","v":"Trostomaat  -  Tomate grapes F1"},null,null,null,"FOUT"]
[{"$f":"IF(B18=\"\",\"\",VLOOKUP(C18,produkten!$A$1:$C$201,3,FALSE))","v":""},{"$f":"IF('bestelbon alg.'!D24=\"\",\"\",IF('bestelbon alg.'!D24=0,\"\",'bestelbon alg.'!D24))","v":""},{"$f":"IF(B18=\"\",\"\",produkten!A13)","v":""},{"$f":"IF(B18=\"\",\"\",produkten!B13)","v":""},{"$f":"'bestelbon alg.'!A24","v":"Italiaanse tomaat - Tomate Roma F1"},null,null,null,"FOUT"]
[{"$f":"IF(B19=\"\",\"\",VLOOKUP(C19,produkten!$A$1:$C$201,3,FALSE))","v":""},{"$f":"IF('bestelbon alg.'!D25=\"\",\"\",IF('bestelbon alg.'!D25=0,\"\",'bestelbon alg.'!D25))","v":""},{"$f":"IF(B19=\"\",\"\",produkten!A14)","v":""},{"$f":"IF(B19=\"\",\"\",produkten!B14)","v":""},{"$f":"'bestelbon alg.'!A25","v":"Tomaat - Tomate 'Cœur de Bœuf'"},null,null,null,"FOUT"]
[{"$f":"IF(B20=\"\",\"\",VLOOKUP(C20,produkten!$A$1:$C$201,3,FALSE))","v":""},{"$f":"IF('bestelbon alg.'!D26=\"\",\"\",IF('bestelbon alg.'!D26=0,\"\",'bestelbon alg.'!D26))","v":""},{"$f":"IF(B20=\"\",\"\",produkten!A15)","v":""},{"$f":"IF(B20=\"\",\"\",produkten!B15)","v":""},{"$f":"'bestelbon alg.'!A26","v":"Snoep tomaat - Tomate Snack F1"},null,null,null,"FOUT"]
[{"$f":"IF(B21=\"\",\"\",VLOOKUP(C21,produkten!$A$1:$C$201,3,FALSE))","v":""},{"$f":"IF('bestelbon alg.'!D27=\"\",\"\",IF('bestelbon alg.'!D27=0,\"\",'bestelbon alg.'!D27))","v":""},{"$f":"IF(B21=\"\",\"\",produkten!A16)","v":""},{"$f":"IF(B21=\"\",\"\",produkten!B16)","v":""},{"$f":"'bestelbon alg.'!A27","v":"Gele tomaat - Tomate jaune F1"},null,null,null,"FOUT"]
[{"$f":"IF(B22=\"\",\"\",VLOOKUP(C22,produkten!$A$1:$C$201,3,FALSE))","v":""},{"$f":"IF('bestelbon alg.'!D28=\"\",\"\",IF('bestelbon alg.'!D28=0,\"\",'bestelbon alg.'!D28))","v":""},{"$f":"IF(B22=\"\",\"\",produkten!A17)","v":""},{"$f":"IF(B22=\"\",\"\",produkten!B17)","v":""},{"$f":"'bestelbon alg.'!A28","v":"Tomaat - Tomate 'Marmande'"},null,null,null,"FOUT"]
[{"$f":"IF(B23=\"\",\"\",VLOOKUP(C23,produkten!$A$1:$C$201,3,FALSE))","v":""},{"$f":"IF('bestelbon alg.'!D29=\"\",\"\",IF('bestelbon alg.'!D29=0,\"\",'bestelbon alg.'!D29))","v":""},{"$f":"IF(B23=\"\",\"\",produkten!A18)","v":""},{"$f":"IF(B23=\"\",\"\",produkten!B18)","v":""},{"$f":"'bestelbon alg.'!A29","v":"Tomaat - Tomate 'Pyros' F1"},null,null,null,"FOUT"]
[{"$f":"IF(B24=\"\",\"\",VLOOKUP(C24,produkten!$A$1:$C$201,3,FALSE))","v":""},{"$f":"IF('bestelbon alg.'!D30=\"\",\"\",IF('bestelbon alg.'!D30=0,\"\",'bestelbon alg.'!D30))","v":""},{"$f":"IF(B24=\"\",\"\",produkten!A19)","v":""},{"$f":"IF(B24=\"\",\"\",produkten!B19)","v":""},{"$f":"'bestelbon alg.'!A30","v":"Tomaat - Tomate 'Saint-Pierre'"},null,null,null,"FOUT"]
[{"$f":"IF(B25=\"\",\"\",VLOOKUP(C25,produkten!$A$1:$C$201,3,FALSE))","v":""},{"$f":"IF('bestelbon alg.'!D31=\"\",\"\",IF('bestelbon alg.'!D31=0,\"\",'bestelbon alg.'!D31))","v":""},{"$f":"IF(B25=\"\",\"\",produkten!A20)","v":""},{"$f":"IF(B25=\"\",\"\",produkten!B20)","v":""},{"$f":"'bestelbon alg.'!A31","v":"Tomaat - Tomate 'Green Zebra'"},null,null,null,"FOUT"]
[{"$f":"IF(B26=\"\",\"\",VLOOKUP(C26,produkten!$A$1:$C$201,3,FALSE))","v":""},{"$f":"IF('bestelbon alg.'!D32=\"\",\"\",IF('bestelbon alg.'!D32=0,\"\",'bestelbon alg.'!D32))","v":""},{"$f":"IF(B26=\"\",\"\",produkten!A21)","v":""},{"$f":"IF(B26=\"\",\"\",produkten!B21)","v":""},{"$f":"'bestelbon alg.'!A32","v":"Tomaat - Tomate 'Noir de Crimée'"},null,null,null,"FOUT"]
[{"$f":"IF(B27=\"\",\"\",VLOOKUP(C27,produkten!$A$1:$C$201,3,FALSE))","v":""},{"$f":"IF('bestelbon alg.'!D33=\"\",\"\",IF('bestelbon alg.'!D33=0,\"\",'bestelbon alg.'!D33))","v":""},{"$f":"IF(B27=\"\",\"\",produkten!A22)","v":""},{"$f":"IF(B27=\"\",\"\",produkten!B22)","v":""},{"$f":"'bestelbon alg.'!A33","v":"Tomaat - Tomate 'Andine Cornue'"},null,null,null,"FOUT"]
[{"$f":"IF(B28=\"\",\"\",VLOOKUP(C28,produkten!$A$1:$C$201,3,FALSE))","v":""},{"$f":"IF('bestelbon alg.'!D34=\"\",\"\",IF('bestelbon alg.'!D34=0,\"\",'bestelbon alg.'!D34))","v":""},{"$f":"IF(B28=\"\",\"\",produkten!A23)","v":""},{"$f":"IF(B28=\"\",\"\",produkten!B23)","v":""},{"$f":"'bestelbon alg.'!A34","v":"Tomaat - Tomate 'Yellow Pear'"},null,null,null,"FOUT"]
[{"$f":"IF(B29=\"\",\"\",VLOOKUP(C29,produkten!$A$1:$C$201,3,FALSE))","v":""},{"$f":"IF('bestelbon alg.'!D35=\"\",\"\",IF('bestelbon alg.'!D35=0,\"\",'bestelbon alg.'!D35))","v":""},{"$f":"IF(B29=\"\",\"\",produkten!A24)","v":""},{"$f":"IF(B29=\"\",\"\",produkten!B24)","v":""},{"$f":"'bestelbon alg.'!A35","v":"Tomaat - Tomate 'Costoluto Genovese'"},null,null,null,"FOUT"]
[{"$f":"IF(B30=\"\",\"\",VLOOKUP(C30,produkten!$A$1:$C$201,3,FALSE))","v":""},{"$f":"IF('bestelbon alg.'!D36=\"\",\"\",IF('bestelbon alg.'!D36=0,\"\",'bestelbon alg.'!D36))","v":""},{"$f":"IF(B30=\"\",\"\",produkten!A25)","v":""},{"$f":"IF(B30=\"\",\"\",produkten!B25)","v":""},{"$f":"'bestelbon alg.'!A36","v":"Meloen - Melon 'Charentais'"},null,null,null,"FOUT"]
[{"$f":"IF(B31=\"\",\"\",VLOOKUP(C31,produkten!$A$1:$C$201,3,FALSE))","v":""},{"$f":"IF('bestelbon alg.'!D37=\"\",\"\",IF('bestelbon alg.'!D37=0,\"\",'bestelbon alg.'!D37))","v":""},{"$f":"IF(B31=\"\",\"\",produkten!A26)","v":""},{"$f":"IF(B31=\"\",\"\",produkten!B26)","v":""},{"$f":"'bestelbon alg.'!A37","v":"Honingmeloen - Melon miel"},null,null,null,"FOUT"]
[{"$f":"IF(B32=\"\",\"\",VLOOKUP(C32,produkten!$A$1:$C$201,3,FALSE))","v":""},{"$f":"IF('bestelbon alg.'!D38=\"\",\"\",IF('bestelbon alg.'!D38=0,\"\",'bestelbon alg.'!D38))","v":""},{"$f":"IF(B32=\"\",\"\",produkten!A27)","v":""},{"$f":"IF(B32=\"\",\"\",produkten!B27)","v":""},{"$f":"'bestelbon alg.'!A38","v":"Watermeloen - Pastèque"},null,null,null,"FOUT"]
[{"$f":"IF(B33=\"\",\"\",VLOOKUP(C33,produkten!$A$1:$C$201,3,FALSE))","v":""},{"$f":"IF('bestelbon alg.'!D39=\"\",\"\",IF('bestelbon alg.'!D39=0,\"\",'bestelbon alg.'!D39))","v":""},{"$f":"IF(B33=\"\",\"\",produkten!A28)","v":""},{"$f":"IF(B33=\"\",\"\",produkten!B28)","v":""},{"$f":"'bestelbon alg.'!A39","v":"Patisson"},null,null,null,"FOUT"]
[{"$f":"IF(B34=\"\",\"\",VLOOKUP(C34,produkten!$A$1:$C$201,3,FALSE))","v":""},{"$f":"IF('bestelbon alg.'!D40=\"\",\"\",IF('bestelbon alg.'!D40=0,\"\",'bestelbon alg.'!D40))","v":""},{"$f":"IF(B34=\"\",\"\",produkten!A29)","v":""},{"$f":"IF(B34=\"\",\"\",produkten!B29)","v":""},{"$f":"'bestelbon alg.'!A40","v":"Courgette Groen - Vert"},null,null,null,"FOUT"]
[{"$f":"IF(B35=\"\",\"\",VLOOKUP(C35,produkten!$A$1:$C$201,3,FALSE))","v":""},{"$f":"IF('bestelbon alg.'!D41=\"\",\"\",IF('bestelbon alg.'!D41=0,\"\",'bestelbon alg.'!D41))","v":""},{"$f":"IF(B35=\"\",\"\",produkten!A30)","v":""},{"$f":"IF(B35=\"\",\"\",produkten!B30)","v":""},{"$f":"'bestelbon alg.'!A41","v":"Courgette Geel - Jaune"},null,null,null,"FOUT"]
[{"$f":"IF(B36=\"\",\"\",VLOOKUP(C36,produkten!$A$1:$C$201,3,FALSE))","v":""},{"$f":"IF('bestelbon alg.'!D42=\"\",\"\",IF('bestelbon alg.'!D42=0,\"\",'bestelbon alg.'!D42))","v":""},{"$f":"IF(B36=\"\",\"\",produkten!A31)","v":""},{"$f":"IF(B36=\"\",\"\",produkten!B31)","v":""},{"$f":"'bestelbon alg.'!A42","v":"Courgette Rond - Ronde"},null,null,null,"FOUT"]
[{"$f":"IF(B37=\"\",\"\",VLOOKUP(C37,produkten!$A$1:$C$201,3,FALSE))","v":""},{"$f":"IF('bestelbon alg.'!D43=\"\",\"\",IF('bestelbon alg.'!D43=0,\"\",'bestelbon alg.'!D43))","v":""},{"$f":"IF(B37=\"\",\"\",produkten!A32)","v":""},{"$f":"IF(B37=\"\",\"\",produkten!B32)","v":""},{"$f":"'bestelbon alg.'!A43","v":"Pompoen - Potiron ' Gele reus'"},null,null,null,"FOUT"]
[{"$f":"IF(B38=\"\",\"\",VLOOKUP(C38,produkten!$A$1:$C$201,3,FALSE))","v":""},{"$f":"IF('bestelbon alg.'!D44=\"\",\"\",IF('bestelbon alg.'!D44=0,\"\",'bestelbon alg.'!D44))","v":""},{"$f":"IF(B38=\"\",\"\",produkten!A33)","v":""},{"$f":"IF(B38=\"\",\"\",produkten!B33)","v":""},{"$f":"'bestelbon alg.'!A44","v":"Potimarron"},null,null,null,"FOUT"]
[{"$f":"IF(B39=\"\",\"\",VLOOKUP(C39,produkten!$A$1:$C$201,3,FALSE))","v":""},{"$f":"IF('bestelbon alg.'!D45=\"\",\"\",IF('bestelbon alg.'!D45=0,\"\",'bestelbon alg.'!D45))","v":""},{"$f":"IF(B39=\"\",\"\",produkten!A34)","v":""},{"$f":"IF(B39=\"\",\"\",produkten!B34)","v":""},{"$f":"'bestelbon alg.'!A45","v":"Butternut pompoen - Citrouille Butternut"},null,null,null,"FOUT"]
[{"$f":"IF(B40=\"\",\"\",VLOOKUP(C40,produkten!$A$1:$C$201,3,FALSE))","v":""},{"$f":"IF('bestelbon alg.'!D46=\"\",\"\",IF('bestelbon alg.'!D46=0,\"\",'bestelbon alg.'!D46))","v":""},{"$f":"IF(B40=\"\",\"\",produkten!A35)","v":""},{"$f":"IF(B40=\"\",\"\",produkten!B35)","v":""},{"$f":"'bestelbon alg.'!A46","v":"Pompoen - Potiron 'Rouge Vif d'Etampes'"},null,null,null,"FOUT"]
{"$rows_left_out":167}
{"sheet":"finaal","index":2,"n_rows":4,"n_cols":6,"rows_kept":4,"cut":false,"hidden":false,"merged":[]}
[null,{"$f":"'bon 1 met nr'!A1","v":"NAAM :"},{"$f":"'bon 1 met nr'!B1","v":""},{"$f":"CONCATENATE(SUBSTITUTE(C1,\" \",\"\"),IF(B2=\"\",TEXT(C3,\"dd-mm-jj\"),TEXT(B2,\"dd-mm-jj\")))","v":""}]
[{"$f":"'bon 1 met nr'!A2","v":"Afhaling : "},{"$f":"'bon 1 met nr'!B2","v":""},{"$f":"'bon 1 met nr'!C2","v":""},{"$f":"C2","v":""}]
[null,{"$f":"'bon 1 met nr'!B3","v":"Datum levering :"},{"$f":"'bon 1 met nr'!C3","v":""}]
[null,{"$f":"'bon 1 met nr'!A4","v":"uur : "},{"$f":"'bon 1 met nr'!B4","v":""},{"$f":"'bon 1 met nr'!C4","v":"#colli : 0"},"# rijen :",{"$f":"COUNTIF(B5:B300,\">0\")","v":0}]

{"sheet":"produkten","index":3,"n_rows":201,"n_cols":3,"rows_kept":201,"cut":false,"hidden":true,"merged":[]}
["Komkommer  -  Concombre","10 cm","AL0020"]
["Snack Komkommer- Concombre snack","10 cm","AL0030"]
["Paprika rood  -  Poivron rouge","10 cm","AL0040"]
["Paprika geel  -  Poivron jaune","10 cm","AL0050"]
["Zoete Punt Paprika - Poivron doux allongé","10 cm","AL0060"]
["Aubergine ","10 cm","AL0070"]
["Spaanse peper  -  Piment","10 cm","AL0080"]
["Potpeper  -  Piment Patio","10 cm","AL0085"]
["Vleestomaat - Tomate Charnue Hybride F1","10 cm","AL0090"]
["Cherrytomaat - Tomate apéritif F1","10 cm","AL0100"]
["Pot tomaat - Tomate Patio","10 cm","AL0110"]
["Trostomaat  -  Tomate grapes F1","10 cm","AL0120"]
["Italiaanse tomaat - Tomate Roma F1","10 cm","AL0130"]
["Tomaat - Tomate 'Cœur de Bœuf'","10 cm","AL0140"]
["Snoep tomaat - Tomate Snack F1","10 cm","AL0150"]
["Gele tomaat - Tomate jaune F1","10 cm","AL0160"]
["Tomaat - Tomate 'Marmande'","10 cm-doosje","AL0170"]
["Tomaat - Tomate 'Pyros' F1","10 cm-doosje","AL0180"]
["Tomaat - Tomate 'Saint-Pierre'","10 cm-doosje","AL0190"]
["Tomaat - Tomate 'Green Zebra'","10 cm-doosje","AL0191"]
["Tomaat - Tomate 'Noir de Crimée'","10 cm-doosje","AL0192"]
["Tomaat - Tomate 'Andine Cornue'","10 cm-doosje","AL0193"]
["Tomaat - Tomate 'Yellow Pear'","10 cm-doosje","AL0195"]
["Tomaat - Tomate 'Costoluto Genovese'","10 cm-doosje","AL0196"]
["Meloen - Melon 'Charentais'","10 cm-doosje","AL0200"]
["Honingmeloen - Melon miel","10 cm-doosje","AL0205"]
[{"$f":"[1]bestelbon!$A38","v":"Watermeloen - Pastèque"},"11 cm-doosje","AL0210"]
["Patisson","10 cm-doosje","AL0220"]
["Courgette Groen - Vert","10 cm-doosje","AL0230"]
["Courgette Geel - jaune","10 cm-doosje","AL0240"]
["Courgette Rond - Ronde","10 cm-doosje","AL0250"]
["Pompoen - Potiron ' Gele reus'","10 cm-doosje","AL0260"]
["Potimarron","10 cm-doosje","AL0270"]
["Butternut pompoen - Citrouille Butternut","10 cm-doosje","AL0272"]
["Pompoen - Potiron 'Rouge Vif d'Etampes'","10 cm-doosje","AL0274"]
["Spaghettipompoen - Courge Spaghetti","10 cm-doosje","AL0276"]
["Augurk - Cornichon","10 cm-doosje","AL0280"]
["Struikboon-Haricot Nain","10 cm-doosje","AL0290"]
["Boterboon - Haricot Nain Beurre","10 cm-doosje","AL0293"]
["Staaksnijboon-Haricot à rames","10 cm-doosje","AL0294"]
{"$rows_left_out":161}