{"text_format":"1","workbook":"xlsx","n_sheets":4,"sheets":["bestelbon alg.","bon 1 met nr","finaal","produkten"],"not_rendered":{"charts":0,"images":1,"macros":1,"external_links":1,"defined_names":3,"comments":0,"pivot_tables":0},"unopened":[],"bounds":{"document_bytes":16777216,"sheet_cells":100000,"rows_first":2000,"rows_last":500,"rows_between":2000,"halvings":0,"cell_chars":16384,"cell_head_chars":4096},"cells_cut":0,"cells_raw":0,"read":"whole","date_system":"1900"}

{"sheet":"bestelbon alg.","index":0,"n_rows":133,"n_cols":10,"rows_kept":133,"cut":false,"hidden":false,"merged":[[0,9,1,9],[66,9,67,9],[125,0,126,3],[127,0,129,3],[130,0,132,3],[77,3,78,3],[8,7,8,9],[74,7,74,9],[77,0,78,1],[77,2,78,2],[37,33,37,35],[102,33,102,35],[7,5,7,6],[8,5,8,6],[73,5,73,6],[74,5,74,6]]}
[]
[]
[]
[]
[]
[]
[]
["KLANT:",null,"Datum afhaling : ",null,null,null,null,"uur/heure:"]
[null,null,"Datum levering :"]
[]
["vruchtgewas - Plants chauds",null,null,"AANTAL",null,"Bladgewas - Plants plain terre",null,null,null,"AANTAL"]
["Komkommer  -  Concombre",null,"10 cm",null,null,"Witte Selder  -  Céleri blanc",null,null,"4 cm"]
["Snack Komkommer- Concombre snack",null,"10 cm",null,null,"Groene Selder  -  Céleri vert",null,null,"4 cm"]
["Paprika rood  -  Poivron rouge",null,"10 cm",null,null,"Knolselder  -  Céleri rave",null,null,"4 cm"]
["Paprika geel  -  Poivron jaune",null,"10 cm",null,null,"Venkel  -  Fenouil",null,null,"4 cm"]
["Zoete Punt Paprika - Poivron doux allongé",null,"10 cm",null,null,"Peterselie  -  Persil",null,null,"4 cm"]
["Aubergine ",null,"10 cm",null,null,"Bladpeterselie - Persil 'Plat'",null,null,"4 cm"]
["Spaanse peper  -  Piment",null,"10 cm",null,null,"Snijselder  -  Céleri à jets",null,null,"4 cm"]
["Potpeper  -  Piment Patio",null,"10 cm",null,null,"Suikerbrood  -  Pain de sucre",null,null,"4 cm"]
["Vleestomaat - Tomate Charnue Hybride F1",null,"10 cm",null,null,"Radicchio",null,null,"4 cm"]
["Cherrytomaat - Tomate apéritif F1",null,"10 cm",null,null,"Chinese kool - Chou Chinois",null,null,"4 cm"]
["Pot tomaat - Tomate Patio",null,"10 cm",null,null,"Paksoi",null,null,"4 cm"]
["Trostomaat  -  Tomate grapes F1",null,"10 cm",null,null,"Rode Biet - Betterave rouge",null,null,"4 cm"]
["Italiaanse tomaat - Tomate Roma F1",null,"10 cm",null,null,"Koolrabi - Chou Rave",null,null,"4 cm"]
["Tomaat - Tomate 'Cœur de Bœuf'",null,"10 cm",null,null,"Lente-Ui  -  Oignons Blancs",null,null,"4 cm"]
["Snoep tomaat - Tomate Snack F1",null,"10 cm",null,null,"Rode Ui - Oignons Rouges",null,null,"4 cm"]
["Gele tomaat - Tomate jaune F1",null,"10 cm",null,null,"Bloemkool - Chou fleur F1",null,null,"4 cm"]
["Tomaat - Tomate 'Marmande'",null,"10 cm-doosje",null,null,"Spruitkool - Chou de Bruxelles F1",null,null,"4 cm"]
["Tomaat - Tomate 'Pyros' F1",null,"10 cm-doosje",null,null,"Savooikool - Chou Milan",null,null,"4 cm"]
["Tomaat - Tomate 'Saint-Pierre'",null,"10 cm-doosje",null,null,"Rode kool - Chou rouge F1",null,null,"4 cm"]
["Tomaat - Tomate 'Green Zebra'",null,"10 cm-doosje",null,null,"Witte kool - Chou blanc F1",null,null,"4 cm"]
["Tomaat - Tomate 'Noir de Crimée'",null,"10 cm-doosje",null,null,"Spitskool - Chou pointu F1",null,null,"4 cm"]
["Tomaat - Tomate 'Andine Cornue'",null,"10 cm-doosje",null,null,"Broccoli - Chou Brocoli F1",null,null,"4 cm"]
["Tomaat - Tomate 'Yellow Pear'",null,"10 cm-doosje",null,null,"Boerenkool - Chou frisé F1",null,null,"4 cm"]
["Tomaat - Tomate 'Costoluto Genovese'",null,"10 cm-doosje",null,null,"Torentjesbloemkool - Chou Romanesco",null,null,"4 cm"]
["Meloen - Melon 'Charentais'",null,"10 cm-doosje",null,null,"Andijvie  -  Scarole",null,null,"4 cm"]
["Honingmeloen - Melon miel",null,"10 cm-doosje",null,null,"Krulandijvie - Fine maraîchère",null,null,"4 cm"]
["Watermeloen - Pastèque",null,"10 cm-doosje",null,null,"Kropsla  -  Laitue",null,null,"4 cm"]
["Patisson",null,"10 cm-doosje",null,null,"Serresla - Laitue de serre",null,null,"4 cm"]
["Courgette Groen - Vert",null,"10 cm-doosje",null,null,"Sla - 5 cm (serre)",null,null,"5 cm"]
["Courgette Geel - Jaune",null,"10 cm-doosje",null,null,"Sla - Laitue 'Lollo Rossa'",null,null,"4 cm"]
["Courgette Rond - Ronde",null,"10 cm-doosje",null,null,"Sla - Laitue 'Lollo Verto'",null,null,"4 cm"]
["Pompoen - Potiron ' Gele reus'",null,"10 cm-doosje",null,null,"4-seizoenen sla  -  Laitue 4-saisons",null,null,"4 cm"]
["Potimarron",null,"10 cm-doosje",null,null,"Eikenbladsla  - Laitue feuille de chêne",null,null,"4 cm"]
["Butternut pompoen - Citrouille Butternut",null,"10 cm-doosje",null,null,"Eikenbladsla groen -  Feuillle de chêne vert",null,null,"4 cm"]
["Pompoen - Potiron 'Rouge Vif d'Etampes'",null,"10 cm-doosje",null,null,"Romeinse  sla -  Laitue Romaine",null,null,"4 cm"]
["Spaghettipompoen - Courge Spaghetti",null,"10 cm-doosje",null,null,"Ijsberg sla  - Laitue iceberg",null,null,"4 cm"]
["Augurk - Cornichon",null,"10 cm-doosje",null,null,"Batavia rood  -  rouge",null,null,"4 cm"]
["Struikboon-Haricot Nain",null,"10 cm-doosje",null,null,"Batavia groen  -  vert",null,null,"4 cm"]
["Boterboon - Haricot Nain Beurre",null,"10 cm-doosje",null,null,"Veldsla - Mâches",null,null,"4 cm"]
["Staaksnijboon-Haricot à rames",null,"10 cm-doosje",null,null,"Spinazie - Épinards",null,null,"4 cm"]
["Erwt - Petits pois",null,"10 cm-doosje",null,null,"Winterbloemkool-Chou fleur d'hiver",null,null,"4 cm"]
["Suikermais - maïs Sucré",null,"10 cm-doosje",null,null,"Vroege kool - Chou fleur primeur"]
[null,null,null,null,null,"Winter Prei Pak - Poireau d'hiver botte (20x50)*",null,null,"doos"]
["Geënte planten - Plantes greffeé",null,null,"AANTAL",null,"* enkel op bestelling/uniquement sur commande"]
["G/ Komkommer  -  Concombre",null,"10 cm-doosje",null,null,"Vruchtdragend - Avec fruits comestible",null,null,null,"AANTAL"]
["G/ Snack Komkommer- Concombre snack",null,"10 cm-doosje",null,null,"Cherrytomaat - Tomate apéritif",null,null,"Ø 19 cm"]
["G/ Aubergine",null,"10 cm-doosje",null,null,"Paprika rood  -  Poivron rouge",null,null,"Ø 19 cm"]
["G/ Vleestomaat - Tomate charnue F1",null,"10 cm-doosje",null,null,"Peper rood - Piment rouge",null,null,"Ø 19 cm"]
["G/ Cherrytomaat - Tomate apéritif F1",null,"10 cm-doosje",null,null,"Peper geel - Piment jaune",null,null,"Ø 19 cm"]
["G/ Trostomaat  -  Tomate grapes F1",null,"10 cm-doosje",null,null,"Snack komkommer - Concombre snack",null,null,"Ø 19 cm"]
["G/ Italiaanse tomaat - Tomate Roma F1",null,"10 cm-doosje",null,null,"Peper 'Torito' rood - Piment rouge 'Torito'",null,null,"Ø 19 cm"]
["G/ Tomaat - Tomate 'Cœur de Bœuf'",null,"10 cm-doosje",null,null,"Snack paprika rood - poivron snack rouge",null,null,"Ø 19 cm"]
["G/ Snoep tomaat - Tomate Snack F1",null,"10 cm-doosje",null,null,"Snack paprika oranje - poivron snack orange",null,null,"Ø 19 cm"]
["G/ Meloen - Melon 'Charentais'",null,"10 cm-doosje",null,null,"Snack paprika geel - poivron snack jaune",null,null,"Ø 19 cm"]
["G/ Tom. geënt getopt - Tom. double tête",null,"10 cm-doosje"]
[null,null,null,null,null,null,null,null,null,{"$f":"IF(J1=\"\",\"\",J1)","v":""}]
[]
[]
[]
[]
[]
[]
["KLANT:",{"$f":"IF(B8=\"\",\"\",B8)","v":""},"Datum afhaling : ",null,null,{"$f":"IF(F8=\"\",\"\",F8)","v":""},null,"uur/heure:",null,{"$f":"IF(J8=\"\",\"\",J8)","v":""}]
[null,{"$f":"IF(B9=\"\",\"\",B9)","v":""},"Datum levering :",null,null,{"$f":"IF(F9=\"\",\"\",F9)","v":""},null,{"$f":"IF(H9=\"\",\"\",H9)","v":""}]
[]
["Kruiden - Plantes Aromatiques 10,5cm",null,null,"AANTAL",null,"Kruiden - Plantes Aromatiques 13cm",null,null,null,"AANTAL"]
["Aztekenkruid (Honingverbena) - L'herbe sucrée des Aztéques",null,"Ø 10,5 cm",null,null,"Basilicum - Basilic 13 cm",null,null,"Ø 13 cm"]
[null,null,null,null,null,"Basilicum rood - Basilic rouge 13 cm",null,null,"Ø 13 cm"]
["Basilicum - Basilic",null,"Ø 10,5 cm",null,null,"Basilicum Thaise - Basilic Thai 13 cm",null,null,"Ø 13 cm"]
["Basilicum Citroen - Basilic Citron",null,"Ø 10,5 cm",null,null,"Bieslook - Ciboulette 13 cm",null,null,"Ø 13 cm"]
["Basilicum Rood - Basilic Rouge",null,"Ø 10,5 cm",null,null,"Citroenverbena - Verveine Citronelle 13 cm",null,null,"Ø 13 cm"]
["Basilicum struik - Basilic Fine vert",null,"Ø 10,5 cm",null,null,"Dragon - Estragon 13 cm",null,null,"Ø 13 cm"]
["Basilicum Thaise - Basilic Thai",null,"Ø 10,5 cm",null,null,"Koriander - Coriandre 13 cm",null,null,"Ø 13 cm"]
["Bieslook - Ciboulette",null,"Ø 10,5 cm",null,null,"Marokkaanse Munt - Menthe Marocaine 13 cm",null,null,"Ø 13 cm"]
["Chinese bieslook - Ciboule de Chine",null,"Ø 10,5 cm",null,null,"Oregano - Origan 13 cm",null,null,"Ø 13 cm"]
["Bloedzuring - Oseille Sanguine",null,"Ø 10,5 cm",null,null,"Peterselie - Persil 13 cm",null,null,"Ø 13 cm"]
["Bonenkruid - Sariette",null,"Ø 10,5 cm",null,null,"Bladpeterselie - Persil plat 13 cm",null,null,"Ø 13 cm"]
["Citroengras - Citronelle de l'Inde",null,"Ø 10,5 cm",null,null,"Pluksla - Laitue à couper 13 cm",null,null,"Ø 13 cm"]
["Citroenmelisse - Mélisse de citron",null,"Ø 10,5 cm",null,null,"Rozemarijn - Romarin 13 cm",null,null,"Ø 13 cm"]
["Citroenverbena - Verveine Citronelle",null,"Ø 10,5 cm",null,null,"Rucola - Roquette 13 cm",null,null,"Ø 13 cm"]
["Colakruid - Cola-végétal",null,"Ø 10,5 cm",null,null,"Salie - Sauge 13 cm",null,null,"Ø 13 cm"]
["Kerrieplant - Plante à Curry",null,"Ø 10,5 cm",null,null,"Tijm - Thym 13 cm",null,null,"Ø 13 cm"]
["Dille - Aneth",null,"Ø 10,5 cm",null,null,"Tijm citroen - Thym citron 13 cm",null,null,"Ø 13 cm"]
["Dragon - Estragon",null,"Ø 10,5 cm"]
["Kamille - Camomille",null,"Ø 10,5 cm",null,null,"Prei - Poireau 13cm",null,null,"Ø 13 cm"]
["Kervel - Cerfeuil",null,"Ø 10,5 cm",null,null,"Rabarber - Rhubarbe 13cm",null,null,"Ø 13 cm"]
["Koriander - Coriandre",null,"Ø 10,5 cm",null,null,"Zoete aardappel - Patate douce 13 cm",null,null,"Ø 13 cm"]
["Lavas - Livêche",null,"Ø 10,5 cm"]
["Marjolein - Marjoleine",null,"Ø 10,5 cm",null,null,"Kruiden - Plantes Aromatiques 24cm"]
["Munt 'Aardbei' - Menthe 'fraise'",null,"Ø 10,5 cm",null,null,"Basilicum - Basilic 24 cm",null,null,"deco Ø 24 cm"]
["Munt 'Appel'- Menthe 'Pomme'",null,"Ø 10,5 cm",null,null,"Munt - Menthe 24 cm",null,null,"deco Ø 24 cm"]
["Marokkaanse Munt - Menthe Marocaine",null,"Ø 10,5 cm",null,null,"Rozemarijn - Romarin 24 cm",null,null,"deco Ø 24 cm"]
["Pepermunt - Menthe Poivrée",null,"Ø 10,5 cm",null,null,"Tijm - Thym 24 cm",null,null,"deco Ø 24 cm"]
["Olijfkruid - Santolina",null,"Ø 10,5 cm",null,null,"BBQ mix 24 cm",null,null,"deco Ø 24 cm"]
["Oregano - Origan",null,"Ø 10,5 cm",null,null,"Pizza-Pasta mix 24 cm",null,null,"deco Ø 24 cm"]
["Pastinaak - Panais",null,"Ø 10,5 cm",null,null,"Provence mix 24cm",null,null,"deco Ø 24 cm"]
["Peterselie - Persil",null,"Ø 10,5 cm"]
["Bladpeterselie - Persil Plat",null,"Ø 10,5 cm",null,null,"Aardbeiplanten - Fraisiers"]
["Pluksla - Laitue à couper",null,"Ø 10,5 cm",null,null,"Hangpot doordrager - Suspension remontant",null,null,"Ø 23 cm"]
["Radijs - Radis",null,"Ø 10,5 cm",null,null,"Hangpot Patio Pink - Suspension Patio pink",null,null,"Ø 23 cm"]
["Rozemarijn - Romarin",null,"Ø 10,5 cm"]
["Rucola - Roquette",null,"Ø 10,5 cm",null,null,"Ostara lente - printemps",null,null,"Ø 10,5 cm"]
["Salanova sla - Laitue Salanova",null,"Ø 10,5 cm",null,null,"Mara de bois lente - printemps",null,null,"Ø 10,5 cm"]
["Salie - Sauge",null,"Ø 10,5 cm",null,null,"Darselect lente - printemps",null,null,"Ø 10,5 cm"]
["Salie ananas - Sauge ananas",null,"Ø 10,5 cm",null,null,"Elsanta lente - printemps",null,null,"Ø 10,5 cm"]
["Snijbiet (Warmoes) - Blette (bette à carde)",null,"Ø 10,5 cm",null,null,"Gariguette lente - printemps",null,null,"Ø 10,5 cm"]
["Stevia",null,"Ø 10,5 cm",null,null,"Korona lente - printemps",null,null,"Ø 10,5 cm"]
["Tijm - Thym",null,"Ø 10,5 cm",null,null,"Lambada lente - printemps",null,null,"Ø 10,5 cm"]
["Tijm Citroen bont - Thym citronelle panaché",null,"Ø 10,5 cm",null,null,"Senga Sengana lente - printemps",null,null,"Ø 10,5 cm"]
["Tijm Citroen - Thym citronelle",null,"Ø 10,5 cm"]
["Valeriaan - Valérian",null,"Ø 10,5 cm",null,null,"Ostara zomer - été",null,null,"Ø 10,5 cm"]
["Wijnruit - Rue  ",null,"Ø 10,5 cm",null,null,"Darselect zomer - été",null,null,"Ø 10,5 cm"]
["Laurier - Laurier sauce",null,"Ø 10,5 cm",null,null,"Elsanta zomer - été",null,null,"Ø 10,5 cm"]
[null,null,null,null,null,"Gariguette zomer - été",null,null,"Ø 10,5 cm"]
["OPGELET - ATTENTION",null,null,null,null,"Vima Xima zomer - été",null,null,"Ø 10,5 cm"]
[]
["Afhalen vóór 10u = Bestellen vóór 12u                                                                                             Ramasser avant 10h = Commander avant 12h",null,null,null,null,"Ostara 13 cm ",null,null,"Ø 13 cm"]
[null,null,null,null,null,"Elsanta 13 cm ",null,null,"Ø 13 cm"]
[null,null,null,null,null,"Bosaardbei - Fraisier des bois 13 cm",null,null,"Ø 13 cm"]
["Afhalen na 10u = Bestellen vóór 14u                               Ramasser après 10h = Commander avant 14h",null,null,null,null,"Patio Pink 13 cm",null,null,"Ø 13 cm"]
[null,null,null,null,null,"Framboo 13 cm ",null,null,"Ø 13 cm"]
[null,null,null,null,null,"Snow white 13cm",null,null,"Ø 13 cm"]

{"sheet":"bon 1 met nr","index":1,"n_rows":206,"n_cols":9,"rows_kept":206,"cut":false,"hidden":false,"merged":[]}
["NAAM :",{"$f":"IF('bestelbon alg.'!B8:F8=\"\",\"\",'bestelbon alg.'!B8:F8)","v":""}]
["Afhaling : ",{"$f":"IF('bestelbon alg.'!F8=\"\",\"\",'bestelbon alg.'!F8)","v":""},{"$f":"IF('bestelbon alg.'!G8=\"\",\"\",'bestelbon alg.'!G8)","v":""}]
[null,"Datum levering :",{"$f":"IF('bestelbon alg.'!F9=\"\",\"\",'bestelbon alg.'!F9)","v":""}]
["uur : ",{"$f":"IF('bestelbon alg.'!J8=\"\",\"\",'bestelbon alg.'!J8)","v":""},{"$f":" \"#colli : \"&TEXT(F206,0)","v":"#colli : 0"}]
[]
[{"$f":"IF(B6=\"\",\"\",VLOOKUP(C6,produkten!$A$1:$C$201,3,FALSE))","v":""},{"$f":"IF('bestelbon alg.'!D12=\"\",\"\",IF('bestelbon alg.'!D12=0,\"\",'bestelbon alg.'!D12))","v":""},{"$f":"IF(B6=\"\",\"\",produkten!A1)","v":""},{"$f":"IF(B6=\"\",\"\",produkten!B1)","v":""},{"$f":"'bestelbon alg.'!A12","v":"Komkommer  -  Concombre"},null,null,null,{"$f":"IF(E6=C6,\"ok\",\"FOUT\")","v":"FOUT"}]
[{"$f":"IF(B7=\"\",\"\",VLOOKUP(C7,produkten!$A$1:$C$201,3,FALSE))","v":""},{"$f":"IF('bestelbon alg.'!D13=\"\",\"\",IF('bestelbon alg.'!D13=0,\"\",'bestelbon alg.'!D13))","v":""},{"$f":"IF(B7=\"\",\"\",produkten!A2)","v":""},{"$f":"IF(B7=\"\",\"\",produkten!B2)","v":""},{"$f":"'bestelbon alg.'!A13","v":"Snack Komkommer- Concombre snack"},null,null,null,{"$f":"IF(E7=C7,\"ok\",\"FOUT\")","v":"FOUT"}]
[{"$f":"IF(B8=\"\",\"\",VLOOKUP(C8,produkten!$A$1:$C$201,3,FALSE))","v":""},{"$f":"IF('bestelbon alg.'!D14=\"\",\"\",IF('bestelbon alg.'!D14=0,\"\",'bestelbon alg.'!D14))","v":""},{"$f":"IF(B8=\"\",\"\",produkten!A3)","v":""},{"$f":"IF(B8=\"\",\"\",produkten!B3)","v":""},{"$f":"'bestelbon alg.'!A14","v":"Paprika rood  -  Poivron rouge"},null,null,null,"FOUT"]
[{"$f":"IF(B9=\"\",\"\",VLOOKUP(C9,produkten!$A$1:$C$201,3,FALSE))","v":""},{"$f":"IF('bestelbon alg.'!D15=\"\",\"\",IF('bestelbon alg.'!D15=0,\"\",'bestelbon alg.'!D15))","v":""},{"$f":"IF(B9=\"\",\"\",produkten!A4)","v":""},{"$f":"IF(B9=\"\",\"\",produkten!B4)","v":""},{"$f":"'bestelbon alg.'!A15","v":"Paprika geel  -  Poivron jaune"},null,null,null,"FOUT"]
[{"$f":"IF(B10=\"\",\"\",VLOOKUP(C10,produkten!$A$1:$C$201,3,FALSE))","v":""},{"$f":"IF('bestelbon alg.'!D16=\"\",\"\",IF('bestelbon alg.'!D16=0,\"\",'bestelbon alg.'!D16))","v":""},{"$f":"IF(B10=\"\",\"\",produkten!A5)","v":""},{"$f":"IF(B10=\"\",\"\",produkten!B5)","v":""},{"$f":"'bestelbon alg.'!A16","v":"Zoete Punt Paprika - Poivron doux allongé"},null,null,null,"FOUT"]
[{"$f":"IF(B11=\"\",\"\",VLOOKUP(C11,produkten!$A$1:$C$201,3,FALSE))","v":""},{"$f":"IF('bestelbon alg.'!D17=\"\",\"\",IF('bestelbon alg.'!D17=0,\"\",'bestelbon alg.'!D17))","v":""},{"$f":"IF(B11=\"\",\"\",produkten!A6)","v":""},{"$f":"IF(B11=\"\",\"\",produkten!B6)","v":""},{"$f":"'bestelbon alg.'!A17","v":"Aubergine "},null,null,null,"FOUT"]
[{"$f":"IF(B12=\"\",\"\",VLOOKUP(C12,produkten!$A$1:$C$201,3,FALSE))","v":""},{"$f":"IF('bestelbon alg.'!D18=\"\",\"\",IF('bestelbon alg.'!D18=0,\"\",'bestelbon alg.'!D18))","v":""},{"$f":"IF(B12=\"\",\"\",produkten!A7)","v":""},{"$f":"IF(B12=\"\",\"\",produkten!B7)","v":""},{"$f":"'bestelbon alg.'!A18","v":"Spaanse peper  -  Piment"},null,null,null,"FOUT"]
[{"$f":"IF(B13=\"\",\"\",VLOOKUP(C13,produkten!$A$1:$C$201,3,FALSE))","v":""},{"$f":"IF('bestelbon alg.'!D19=\"\",\"\",IF('bestelbon alg.'!D19=0,\"\",'bestelbon alg.'!D19))","v":""},{"$f":"IF(B13=\"\",\"\",produkten!A8)","v":""},{"$f":"IF(B13=\"\",\"\",produkten!B8)","v":""},{"$f":"'bestelbon alg.'!A19","v":"Potpeper  -  Piment Patio"},null,null,null,"FOUT"]
[{"$f":"IF(B14=\"\",\"\",VLOOKUP(C14,produkten!$A$1:$C$201,3,FALSE))","v":""},{"$f":"IF('bestelbon alg.'!D20=\"\",\"\",IF('bestelbon alg.'!D20=0,\"\",'bestelbon alg.'!D20))","v":""},{"$f":"IF(B14=\"\",\"\",produkten!A9)","v":""},{"$f":"IF(B14=\"\",\"\",produkten!B9)","v":""},{"$f":"'bestelbon alg.'!A20","v":"Vleestomaat - Tomate Charnue Hybride F1"},null,null,null,"FOUT"]
[{"$f":"IF(B15=\"\",\"\",VLOOKUP(C15,produkten!$A$1:$C$201,3,FALSE))","v":""},{"$f":"IF('bestelbon alg.'!D21=\"\",\"\",IF('bestelbon alg.'!D21=0,\"\",'bestelbon alg.'!D21))","v":""},{"$f":"IF(B15=\"\",\"\",produkten!A10)","v":""},{"$f":"IF(B15=\"\",\"\",produkten!B10)","v":""},{"$f":"'bestelbon alg.'!A21","v":"Cherrytomaat - Tomate apéritif F1"},null,null,null,"FOUT"]
[{"$f":"IF(B16=\"\",\"\",VLOOKUP(C16,produkten!$A$1:$C$201,3,FALSE))","v":""},{"$f":"IF('bestelbon alg.'!D22=\"\",\"\",IF('bestelbon alg.'!D22=0,\"\",'bestelbon alg.'!D22))","v":""},{"$f":"IF(B16=\"\",\"\",produkten!A11)","v":""},{"$f":"IF(B16=\"\",\"\",produkten!B11)","v":""},{"$f":"'bestelbon alg.'!A22","v":"Pot tomaat - Tomate Patio"},null,null,null,"FOUT"]
[{"$f":"IF(B17=\"\",\"\",VLOOKUP(C17,produkten!$A$1:$C$201,3,FALSE))","v":""},{"$f":"IF('bestelbon alg.'!D23=\"\",\"\",IF('bestelbon alg.'!D23=0,\"\",'bestelbon alg.'!D23))","v":""},{"$f":"IF(B17=\"\",\"\",produkten!A12)","v":""},{"$f":"IF(B17=\"\",\"\",produkten!B12)","v":""},{"$f":"'bestelbon alg.'!A23","v":"Trostomaat  -  Tomate grapes F1"},null,null,null,"FOUT"]
[{"$f":"IF(B18=\"\",\"\",VLOOKUP(C18,produkten!$A$1:$C$201,3,FALSE))","v":""},{"$f":"IF('bestelbon alg.'!D24=\"\",\"\",IF('bestelbon alg.'!D24=0,\"\",'bestelbon alg.'!D24))","v":""},{"$f":"IF(B18=\"\",\"\",produkten!A13)","v":""},{"$f":"IF(B18=\"\",\"\",produkten!B13)","v":""},{"$f":"'bestelbon alg.'!A24","v":"Italiaanse tomaat - Tomate Roma F1"},null,null,null,"FOUT"]
[{"$f":"IF(B19=\"\",\"\",VLOOKUP(C19,produkten!$A$1:$C$201,3,FALSE))","v":""},{"$f":"IF('bestelbon alg.'!D25=\"\",\"\",IF('bestelbon alg.'!D25=0,\"\",'bestelbon alg.'!D25))","v":""},{"$f":"IF(B19=\"\",\"\",produkten!A14)","v":""},{"$f":"IF(B19=\"\",\"\",produkten!B14)","v":""},{"$f":"'bestelbon alg.'!A25","v":"Tomaat - Tomate 'Cœur de Bœuf'"},null,null,null,"FOUT"]
[{"$f":"IF(B20=\"\",\"\",VLOOKUP(C20,produkten!$A$1:$C$201,3,FALSE))","v":""},{"$f":"IF('bestelbon alg.'!D26=\"\",\"\",IF('bestelbon alg.'!D26=0,\"\",'bestelbon alg.'!D26))","v":""},{"$f":"IF(B20=\"\",\"\",produkten!A15)","v":""},{"$f":"IF(B20=\"\",\"\",produkten!B15)","v":""},{"$f":"'bestelbon alg.'!A26","v":"Snoep tomaat - Tomate Snack F1"},null,null,null,"FOUT"]
[{"$f":"IF(B21=\"\",\"\",VLOOKUP(C21,produkten!$A$1:$C$201,3,FALSE))","v":""},{"$f":"IF('bestelbon alg.'!D27=\"\",\"\",IF('bestelbon alg.'!D27=0,\"\",'bestelbon alg.'!D27))","v":""},{"$f":"IF(B21=\"\",\"\",produkten!A16)","v":""},{"$f":"IF(B21=\"\",\"\",produkten!B16)","v":""},{"$f":"'bestelbon alg.'!A27","v":"Gele tomaat - Tomate jaune F1"},null,null,null,"FOUT"]
[{"$f":"IF(B22=\"\",\"\",VLOOKUP(C22,produkten!$A$1:$C$201,3,FALSE))","v":""},{"$f":"IF('bestelbon alg.'!D28=\"\",\"\",IF('bestelbon alg.'!D28=0,\"\",'bestelbon alg.'!D28))","v":""},{"$f":"IF(B22=\"\",\"\",produkten!A17)","v":""},{"$f":"IF(B22=\"\",\"\",produkten!B17)","v":""},{"$f":"'bestelbon alg.'!A28","v":"Tomaat - Tomate 'Marmande'"},null,null,null,"FOUT"]
[{"$f":"IF(B23=\"\",\"\",VLOOKUP(C23,produkten!$A$1:$C$201,3,FALSE))","v":""},{"$f":"IF('bestelbon alg.'!D29=\"\",\"\",IF('bestelbon alg.'!D29=0,\"\",'bestelbon alg.'!D29))","v":""},{"$f":"IF(B23=\"\",\"\",produkten!A18)","v":""},{"$f":"IF(B23=\"\",\"\",produkten!B18)","v":""},{"$f":"'bestelbon alg.'!A29","v":"Tomaat - Tomate 'Pyros' F1"},null,null,null,"FOUT"]
[{"$f":"IF(B24=\"\",\"\",VLOOKUP(C24,produkten!$A$1:$C$201,3,FALSE))","v":""},{"$f":"IF('bestelbon alg.'!D30=\"\",\"\",IF('bestelbon alg.'!D30=0,\"\",'bestelbon alg.'!D30))","v":""},{"$f":"IF(B24=\"\",\"\",produkten!A19)","v":""},{"$f":"IF(B24=\"\",\"\",produkten!B19)","v":""},{"$f":"'bestelbon alg.'!A30","v":"Tomaat - Tomate 'Saint-Pierre'"},null,null,null,"FOUT"]
[{"$f":"IF(B25=\"\",\"\",VLOOKUP(C25,produkten!$A$1:$C$201,3,FALSE))","v":""},{"$f":"IF('bestelbon alg.'!D31=\"\",\"\",IF('bestelbon alg.'!D31=0,\"\",'bestelbon alg.'!D31))","v":""},{"$f":"IF(B25=\"\",\"\",produkten!A20)","v":""},{"$f":"IF(B25=\"\",\"\",produkten!B20)","v":""},{"$f":"'bestelbon alg.'!A31","v":"Tomaat - Tomate 'Green Zebra'"},null,null,null,"FOUT"]
[{"$f":"IF(B26=\"\",\"\",VLOOKUP(C26,produkten!$A$1:$C$201,3,FALSE))","v":""},{"$f":"IF('bestelbon alg.'!D32=\"\",\"\",IF('bestelbon alg.'!D32=0,\"\",'bestelbon alg.'!D32))","v":""},{"$f":"IF(B26=\"\",\"\",produkten!A21)","v":""},{"$f":"IF(B26=\"\",\"\",produkten!B21)","v":""},{"$f":"'bestelbon alg.'!A32","v":"Tomaat - Tomate 'Noir de Crimée'"},null,null,null,"FOUT"]
[{"$f":"IF(B27=\"\",\"\",VLOOKUP(C27,produkten!$A$1:$C$201,3,FALSE))","v":""},{"$f":"IF('bestelbon alg.'!D33=\"\",\"\",IF('bestelbon alg.'!D33=0,\"\",'bestelbon alg.'!D33))","v":""},{"$f":"IF(B27=\"\",\"\",produkten!A22)","v":""},{"$f":"IF(B27=\"\",\"\",produkten!B22)","v":""},{"$f":"'bestelbon alg.'!A33","v":"Tomaat - Tomate 'Andine Cornue'"},null,null,null,"FOUT"]
[{"$f":"IF(B28=\"\",\"\",VLOOKUP(C28,produkten!$A$1:$C$201,3,FALSE))","v":""},{"$f":"IF('bestelbon alg.'!D34=\"\",\"\",IF('bestelbon alg.'!D34=0,\"\",'bestelbon alg.'!D34))","v":""},{"$f":"IF(B28=\"\",\"\",produkten!A23)","v":""},{"$f":"IF(B28=\"\",\"\",produkten!B23)","v":""},{"$f":"'bestelbon alg.'!A34","v":"Tomaat - Tomate 'Yellow Pear'"},null,null,null,"FOUT"]
[{"$f":"IF(B29=\"\",\"\",VLOOKUP(C29,produkten!$A$1:$C$201,3,FALSE))","v":""},{"$f":"IF('bestelbon alg.'!D35=\"\",\"\",IF('bestelbon alg.'!D35=0,\"\",'bestelbon alg.'!D35))","v":""},{"$f":"IF(B29=\"\",\"\",produkten!A24)","v":""},{"$f":"IF(B29=\"\",\"\",produkten!B24)","v":""},{"$f":"'bestelbon alg.'!A35","v":"Tomaat - Tomate 'Costoluto Genovese'"},null,null,null,"FOUT"]
[{"$f":"IF(B30=\"\",\"\",VLOOKUP(C30,produkten!$A$1:$C$201,3,FALSE))","v":""},{"$f":"IF('bestelbon alg.'!D36=\"\",\"\",IF('bestelbon alg.'!D36=0,\"\",'bestelbon alg.'!D36))","v":""},{"$f":"IF(B30=\"\",\"\",produkten!A25)","v":""},{"$f":"IF(B30=\"\",\"\",produkten!B25)","v":""},{"$f":"'bestelbon alg.'!A36","v":"Meloen - Melon 'Charentais'"},null,null,null,"FOUT"]
[{"$f":"IF(B31=\"\",\"\",VLOOKUP(C31,produkten!$A$1:$C$201,3,FALSE))","v":""},{"$f":"IF('bestelbon alg.'!D37=\"\",\"\",IF('bestelbon alg.'!D37=0,\"\",'bestelbon alg.'!D37))","v":""},{"$f":"IF(B31=\"\",\"\",produkten!A26)","v":""},{"$f":"IF(B31=\"\",\"\",produkten!B26)","v":""},{"$f":"'bestelbon alg.'!A37","v":"Honingmeloen - Melon miel"},null,null,null,"FOUT"]
[{"$f":"IF(B32=\"\",\"\",VLOOKUP(C32,produkten!$A$1:$C$201,3,FALSE))","v":""},{"$f":"IF('bestelbon alg.'!D38=\"\",\"\",IF('bestelbon alg.'!D38=0,\"\",'bestelbon alg.'!D38))","v":""},{"$f":"IF(B32=\"\",\"\",produkten!A27)","v":""},{"$f":"IF(B32=\"\",\"\",produkten!B27)","v":""},{"$f":"'bestelbon alg.'!A38","v":"Watermeloen - Pastèque"},null,null,null,"FOUT"]
[{"$f":"IF(B33=\"\",\"\",VLOOKUP(C33,produkten!$A$1:$C$201,3,FALSE))","v":""},{"$f":"IF('bestelbon alg.'!D39=\"\",\"\",IF('bestelbon alg.'!D39=0,\"\",'bestelbon alg.'!D39))","v":""},{"$f":"IF(B33=\"\",\"\",produkten!A28)","v":""},{"$f":"IF(B33=\"\",\"\",produkten!B28)","v":""},{"$f":"'bestelbon alg.'!A39","v":"Patisson"},null,null,null,"FOUT"]
[{"$f":"IF(B34=\"\",\"\",VLOOKUP(C34,produkten!$A$1:$C$201,3,FALSE))","v":""},{"$f":"IF('bestelbon alg.'!D40=\"\",\"\",IF('bestelbon alg.'!D40=0,\"\",'bestelbon alg.'!D40))","v":""},{"$f":"IF(B34=\"\",\"\",produkten!A29)","v":""},{"$f":"IF(B34=\"\",\"\",produkten!B29)","v":""},{"$f":"'bestelbon alg.'!A40","v":"Courgette Groen - Vert"},null,null,null,"FOUT"]
[{"$f":"IF(B35=\"\",\"\",VLOOKUP(C35,produkten!$A$1:$C$201,3,FALSE))","v":""},{"$f":"IF('bestelbon alg.'!D41=\"\",\"\",IF('bestelbon alg.'!D41=0,\"\",'bestelbon alg.'!D41))","v":""},{"$f":"IF(B35=\"\",\"\",produkten!A30)","v":""},{"$f":"IF(B35=\"\",\"\",produkten!B30)","v":""},{"$f":"'bestelbon alg.'!A41","v":"Courgette Geel - Jaune"},null,null,null,"FOUT"]
[{"$f":"IF(B36=\"\",\"\",VLOOKUP(C36,produkten!$A$1:$C$201,3,FALSE))","v":""},{"$f":"IF('bestelbon alg.'!D42=\"\",\"\",IF('bestelbon alg.'!D42=0,\"\",'bestelbon alg.'!D42))","v":""},{"$f":"IF(B36=\"\",\"\",produkten!A31)","v":""},{"$f":"IF(B36=\"\",\"\",produkten!B31)","v":""},{"$f":"'bestelbon alg.'!A42","v":"Courgette Rond - Ronde"},null,null,null,"FOUT"]
[{"$f":"IF(B37=\"\",\"\",VLOOKUP(C37,produkten!$A$1:$C$201,3,FALSE))","v":""},{"$f":"IF('bestelbon alg.'!D43=\"\",\"\",IF('bestelbon alg.'!D43=0,\"\",'bestelbon alg.'!D43))","v":""},{"$f":"IF(B37=\"\",\"\",produkten!A32)","v":""},{"$f":"IF(B37=\"\",\"\",produkten!B32)","v":""},{"$f":"'bestelbon alg.'!A43","v":"Pompoen - Potiron ' Gele reus'"},null,null,null,"FOUT"]
[{"$f":"IF(B38=\"\",\"\",VLOOKUP(C38,produkten!$A$1:$C$201,3,FALSE))","v":""},{"$f":"IF('bestelbon alg.'!D44=\"\",\"\",IF('bestelbon alg.'!D44=0,\"\",'bestelbon alg.'!D44))","v":""},{"$f":"IF(B38=\"\",\"\",produkten!A33)","v":""},{"$f":"IF(B38=\"\",\"\",produkten!B33)","v":""},{"$f":"'bestelbon alg.'!A44","v":"Potimarron"},null,null,null,"FOUT"]
[{"$f":"IF(B39=\"\",\"\",VLOOKUP(C39,produkten!$A$1:$C$201,3,FALSE))","v":""},{"$f":"IF('bestelbon alg.'!D45=\"\",\"\",IF('bestelbon alg.'!D45=0,\"\",'bestelbon alg.'!D45))","v":""},{"$f":"IF(B39=\"\",\"\",produkten!A34)","v":""},{"$f":"IF(B39=\"\",\"\",produkten!B34)","v":""},{"$f":"'bestelbon alg.'!A45","v":"Butternut pompoen - Citrouille Butternut"},null,null,null,"FOUT"]
[{"$f":"IF(B40=\"\",\"\",VLOOKUP(C40,produkten!$A$1:$C$201,3,FALSE))","v":""},{"$f":"IF('bestelbon alg.'!D46=\"\",\"\",IF('bestelbon alg.'!D46=0,\"\",'bestelbon alg.'!D46))","v":""},{"$f":"IF(B40=\"\",\"\",produkten!A35)","v":""},{"$f":"IF(B40=\"\",\"\",produkten!B35)","v":""},{"$f":"'bestelbon alg.'!A46","v":"Pompoen - Potiron 'Rouge Vif d'Etampes'"},null,null,null,"FOUT"]
[{"$f":"IF(B41=\"\",\"\",VLOOKUP(C41,produkten!$A$1:$C$201,3,FALSE))","v":""},{"$f":"IF('bestelbon alg.'!D47=\"\",\"\",IF('bestelbon alg.'!D47=0,\"\",'bestelbon alg.'!D47))","v":""},{"$f":"IF(B41=\"\",\"\",produkten!A36)","v":""},{"$f":"IF(B41=\"\",\"\",produkten!B36)","v":""},{"$f":"'bestelbon alg.'!A47","v":"Spaghettipompoen - Courge Spaghetti"},null,null,null,"FOUT"]
[{"$f":"IF(B42=\"\",\"\",VLOOKUP(C42,produkten!$A$1:$C$201,3,FALSE))","v":""},{"$f":"IF('bestelbon alg.'!D48=\"\",\"\",IF('bestelbon alg.'!D48=0,\"\",'bestelbon alg.'!D48))","v":""},{"$f":"IF(B42=\"\",\"\",produkten!A37)","v":""},{"$f":"IF(B42=\"\",\"\",produkten!B37)","v":""},{"$f":"'bestelbon alg.'!A48","v":"Augurk - Cornichon"},null,null,null,"FOUT"]
[{"$f":"IF(B43=\"\",\"\",VLOOKUP(C43,produkten!$A$1:$C$201,3,FALSE))","v":""},{"$f":"IF('bestelbon alg.'!D49=\"\",\"\",IF('bestelbon alg.'!D49=0,\"\",'bestelbon alg.'!D49))","v":""},{"$f":"IF(B43=\"\",\"\",produkten!A38)","v":""},{"$f":"IF(B43=\"\",\"\",produkten!B38)","v":""},{"$f":"'bestelbon alg.'!A49","v":"Struikboon-Haricot Nain"},null,null,null,"FOUT"]
[{"$f":"IF(B44=\"\",\"\",VLOOKUP(C44,produkten!$A$1:$C$201,3,FALSE))","v":""},{"$f":"IF('bestelbon alg.'!D50=\"\",\"\",IF('bestelbon alg.'!D50=0,\"\",'bestelbon alg.'!D50))","v":""},{"$f":"IF(B44=\"\",\"\",produkten!A39)","v":""},{"$f":"IF(B44=\"\",\"\",produkten!B39)","v":""},{"$f":"'bestelbon alg.'!A50","v":"Boterboon - Haricot Nain Beurre"},null,null,null,"FOUT"]
[{"$f":"IF(B45=\"\",\"\",VLOOKUP(C45,produkten!$A$1:$C$201,3,FALSE))","v":""},{"$f":"IF('bestelbon alg.'!D51=\"\",\"\",IF('bestelbon alg.'!D51=0,\"\",'bestelbon alg.'!D51))","v":""},{"$f":"IF(B45=\"\",\"\",produkten!A40)","v":""},{"$f":"IF(B45=\"\",\"\",produkten!B40)","v":""},{"$f":"'bestelbon alg.'!A51","v":"Staaksnijboon-Haricot à rames"},null,null,null,"FOUT"]
[{"$f":"IF(B46=\"\",\"\",VLOOKUP(C46,produkten!$A$1:$C$201,3,FALSE))","v":""},{"$f":"IF('bestelbon alg.'!D52=\"\",\"\",IF('bestelbon alg.'!D52=0,\"\",'bestelbon alg.'!D52))","v":""},{"$f":"IF(B46=\"\",\"\",produkten!A41)","v":""},{"$f":"IF(B46=\"\",\"\",produkten!B41)","v":""},{"$f":"'bestelbon alg.'!A52","v":"Erwt - Petits pois"},null,null,null,"FOUT"]
[{"$f":"IF(B47=\"\",\"\",VLOOKUP(C47,produkten!$A$1:$C$201,3,FALSE))","v":""},{"$f":"IF('bestelbon alg.'!D53=\"\",\"\",IF('bestelbon alg.'!D53=0,\"\",'bestelbon alg.'!D53))","v":""},{"$f":"IF(B47=\"\",\"\",produkten!A42)","v":""},{"$f":"IF(B47=\"\",\"\",produkten!B42)","v":""},{"$f":"'bestelbon alg.'!A53","v":"Suikermais - maïs Sucré"},null,null,null,"FOUT"]
[{"$f":"IF(B48=\"\",\"\",VLOOKUP(C48,produkten!$A$1:$C$201,3,FALSE))","v":""},{"$f":"IF('bestelbon alg.'!D56=\"\",\"\",IF('bestelbon alg.'!D56=0,\"\",'bestelbon alg.'!D56))","v":""},{"$f":"IF(B48=\"\",\"\",produkten!A43)","v":""},{"$f":"IF(B48=\"\",\"\",produkten!B43)","v":""},{"$f":"'bestelbon alg.'!A56","v":"G/ Komkommer  -  Concombre"},null,null,null,"FOUT"]
[{"$f":"IF(B49=\"\",\"\",VLOOKUP(C49,produkten!$A$1:$C$201,3,FALSE))","v":""},{"$f":"IF('bestelbon alg.'!D57=\"\",\"\",IF('bestelbon alg.'!D57=0,\"\",'bestelbon alg.'!D57))","v":""},{"$f":"IF(B49=\"\",\"\",produkten!A44)","v":""},{"$f":"IF(B49=\"\",\"\",produkten!B44)","v":""},{"$f":"'bestelbon alg.'!A57","v":"G/ Snack Komkommer- Concombre snack"},null,null,null,"FOUT"]
[{"$f":"IF(B50=\"\",\"\",VLOOKUP(C50,produkten!$A$1:$C$201,3,FALSE))","v":""},{"$f":"IF('bestelbon alg.'!D58=\"\",\"\",IF('bestelbon alg.'!D58=0,\"\",'bestelbon alg.'!D58))","v":""},{"$f":"IF(B50=\"\",\"\",produkten!A45)","v":""},{"$f":"IF(B50=\"\",\"\",produkten!B45)","v":""},{"$f":"'bestelbon alg.'!A58","v":"G/ Aubergine"},null,null,null,"FOUT"]
[{"$f":"IF(B51=\"\",\"\",VLOOKUP(C51,produkten!$A$1:$C$201,3,FALSE))","v":""},{"$f":"IF('bestelbon alg.'!D59=\"\",\"\",IF('bestelbon alg.'!D59=0,\"\",'bestelbon alg.'!D59))","v":""},{"$f":"IF(B51=\"\",\"\",produkten!A46)","v":""},{"$f":"IF(B51=\"\",\"\",produkten!B46)","v":""},{"$f":"'bestelbon alg.'!A59","v":"G/ Vleestomaat - Tomate charnue F1"},null,null,null,"FOUT"]
[{"$f":"IF(B52=\"\",\"\",VLOOKUP(C52,produkten!$A$1:$C$201,3,FALSE))","v":""},{"$f":"IF('bestelbon alg.'!D60=\"\",\"\",IF('bestelbon alg.'!D60=0,\"\",'bestelbon alg.'!D60))","v":""},{"$f":"IF(B52=\"\",\"\",produkten!A47)","v":""},{"$f":"IF(B52=\"\",\"\",produkten!B47)","v":""},{"$f":"'bestelbon alg.'!A60","v":"G/ Cherrytomaat - Tomate apéritif F1"},null,null,null,"FOUT"]
[{"$f":"IF(B53=\"\",\"\",VLOOKUP(C53,produkten!$A$1:$C$201,3,FALSE))","v":""},{"$f":"IF('bestelbon alg.'!D61=\"\",\"\",IF('bestelbon alg.'!D61=0,\"\",'bestelbon alg.'!D61))","v":""},{"$f":"IF(B53=\"\",\"\",produkten!A48)","v":""},{"$f":"IF(B53=\"\",\"\",produkten!B48)","v":""},{"$f":"'bestelbon alg.'!A61","v":"G/ Trostomaat  -  Tomate grapes F1"},null,null,null,"FOUT"]
[{"$f":"IF(B54=\"\",\"\",VLOOKUP(C54,produkten!$A$1:$C$201,3,FALSE))","v":""},{"$f":"IF('bestelbon alg.'!D62=\"\",\"\",IF('bestelbon alg.'!D62=0,\"\",'bestelbon alg.'!D62))","v":""},{"$f":"IF(B54=\"\",\"\",produkten!A49)","v":""},{"$f":"IF(B54=\"\",\"\",produkten!B49)","v":""},{"$f":"'bestelbon alg.'!A62","v":"G/ Italiaanse tomaat - Tomate Roma F1"},null,null,null,"FOUT"]
[{"$f":"IF(B55=\"\",\"\",VLOOKUP(C55,produkten!$A$1:$C$201,3,FALSE))","v":""},{"$f":"IF('bestelbon alg.'!D63=\"\",\"\",IF('bestelbon alg.'!D63=0,\"\",'bestelbon alg.'!D63))","v":""},{"$f":"IF(B55=\"\",\"\",produkten!A50)","v":""},{"$f":"IF(B55=\"\",\"\",produkten!B50)","v":""},{"$f":"'bestelbon alg.'!A63","v":"G/ Tomaat - Tomate 'Cœur de Bœuf'"},null,null,null,"FOUT"]
[{"$f":"IF(B56=\"\",\"\",VLOOKUP(C56,produkten!$A$1:$C$201,3,FALSE))","v":""},{"$f":"IF('bestelbon alg.'!D64=\"\",\"\",IF('bestelbon alg.'!D64=0,\"\",'bestelbon alg.'!D64))","v":""},{"$f":"IF(B56=\"\",\"\",produkten!A51)","v":""},{"$f":"IF(B56=\"\",\"\",produkten!B51)","v":""},{"$f":"'bestelbon alg.'!A64","v":"G/ Snoep tomaat - Tomate Snack F1"},null,null,null,"FOUT"]
[{"$f":"IF(B57=\"\",\"\",VLOOKUP(C57,produkten!$A$1:$C$201,3,FALSE))","v":""},{"$f":"IF('bestelbon alg.'!D65=\"\",\"\",IF('bestelbon alg.'!D65=0,\"\",'bestelbon alg.'!D65))","v":""},{"$f":"IF(B57=\"\",\"\",produkten!A52)","v":""},{"$f":"IF(B57=\"\",\"\",produkten!B52)","v":""},{"$f":"'bestelbon alg.'!A65","v":"G/ Meloen - Melon 'Charentais'"},null,null,null,"FOUT"]
[{"$f":"IF(B58=\"\",\"\",VLOOKUP(C58,produkten!$A$1:$C$201,3,FALSE))","v":""},{"$f":"IF('bestelbon alg.'!D66=\"\",\"\",IF('bestelbon alg.'!D66=0,\"\",'bestelbon alg.'!D66))","v":""},{"$f":"IF(B58=\"\",\"\",produkten!A53)","v":""},{"$f":"IF(B58=\"\",\"\",produkten!B53)","v":""},{"$f":"'bestelbon alg.'!A66","v":"G/ Tom. geënt getopt - Tom. double tête"},null,null,null,"FOUT"]
[{"$f":"IF(B59=\"\",\"\",VLOOKUP(C59,produkten!$A$1:$C$201,3,FALSE))","v":""},{"$f":"IF('bestelbon alg.'!J12=\"\",\"\",IF('bestelbon alg.'!J12=0,\"\",'bestelbon alg.'!J12))","v":""},{"$f":"IF(B59=\"\",\"\",produkten!A100)","v":""},{"$f":"IF(B59=\"\",\"\",produkten!B100)","v":""},{"$f":"'bestelbon alg.'!F12","v":"Witte Selder  -  Céleri blanc"},null,null,null,"FOUT"]
[{"$f":"IF(B60=\"\",\"\",VLOOKUP(C60,produkten!$A$1:$C$201,3,FALSE))","v":""},{"$f":"IF('bestelbon alg.'!J13=\"\",\"\",IF('bestelbon alg.'!J13=0,\"\",'bestelbon alg.'!J13))","v":""},{"$f":"IF(B60=\"\",\"\",produkten!A101)","v":""},{"$f":"IF(B60=\"\",\"\",produkten!B101)","v":""},{"$f":"'bestelbon alg.'!F13","v":"Groene Selder  -  Céleri vert"},null,null,null,"FOUT"]
[{"$f":"IF(B61=\"\",\"\",VLOOKUP(C61,produkten!$A$1:$C$201,3,FALSE))","v":""},{"$f":"IF('bestelbon alg.'!J14=\"\",\"\",IF('bestelbon alg.'!J14=0,\"\",'bestelbon alg.'!J14))","v":""},{"$f":"IF(B61=\"\",\"\",produkten!A102)","v":""},{"$f":"IF(B61=\"\",\"\",produkten!B102)","v":""},{"$f":"'bestelbon alg.'!F14","v":"Knolselder  -  Céleri rave"},null,null,null,"FOUT"]
[{"$f":"IF(B62=\"\",\"\",VLOOKUP(C62,produkten!$A$1:$C$201,3,FALSE))","v":""},{"$f":"IF('bestelbon alg.'!J15=\"\",\"\",IF('bestelbon alg.'!J15=0,\"\",'bestelbon alg.'!J15))","v":""},{"$f":"IF(B62=\"\",\"\",produkten!A103)","v":""},{"$f":"IF(B62=\"\",\"\",produkten!B103)","v":""},{"$f":"'bestelbon alg.'!F15","v":"Venkel  -  Fenouil"},null,null,null,"FOUT"]
[{"$f":"IF(B63=\"\",\"\",VLOOKUP(C63,produkten!$A$1:$C$201,3,FALSE))","v":""},{"$f":"IF('bestelbon alg.'!J16=\"\",\"\",IF('bestelbon alg.'!J16=0,\"\",'bestelbon alg.'!J16))","v":""},{"$f":"IF(B63=\"\",\"\",produkten!A104)","v":""},{"$f":"IF(B63=\"\",\"\",produkten!B104)","v":""},{"$f":"'bestelbon alg.'!F16","v":"Peterselie  -  Persil"},null,null,null,"FOUT"]
[{"$f":"IF(B64=\"\",\"\",VLOOKUP(C64,produkten!$A$1:$C$201,3,FALSE))","v":""},{"$f":"IF('bestelbon alg.'!J17=\"\",\"\",IF('bestelbon alg.'!J17=0,\"\",'bestelbon alg.'!J17))","v":""},{"$f":"IF(B64=\"\",\"\",produkten!A105)","v":""},{"$f":"IF(B64=\"\",\"\",produkten!B105)","v":""},{"$f":"'bestelbon alg.'!F17","v":"Bladpeterselie - Persil 'Plat'"},null,null,null,"FOUT"]
[{"$f":"IF(B65=\"\",\"\",VLOOKUP(C65,produkten!$A$1:$C$201,3,FALSE))","v":""},{"$f":"IF('bestelbon alg.'!J18=\"\",\"\",IF('bestelbon alg.'!J18=0,\"\",'bestelbon alg.'!J18))","v":""},{"$f":"IF(B65=\"\",\"\",produkten!A106)","v":""},{"$f":"IF(B65=\"\",\"\",produkten!B106)","v":""},{"$f":"'bestelbon alg.'!F18","v":"Snijselder  -  Céleri à jets"},null,null,null,"FOUT"]
[{"$f":"IF(B66=\"\",\"\",VLOOKUP(C66,produkten!$A$1:$C$201,3,FALSE))","v":""},{"$f":"IF('bestelbon alg.'!J19=\"\",\"\",IF('bestelbon alg.'!J19=0,\"\",'bestelbon alg.'!J19))","v":""},{"$f":"IF(B66=\"\",\"\",produkten!A107)","v":""},{"$f":"IF(B66=\"\",\"\",produkten!B107)","v":""},{"$f":"'bestelbon alg.'!F19","v":"Suikerbrood  -  Pain de sucre"},null,null,null,"FOUT"]
[{"$f":"IF(B67=\"\",\"\",VLOOKUP(C67,produkten!$A$1:$C$201,3,FALSE))","v":""},{"$f":"IF('bestelbon alg.'!J20=\"\",\"\",IF('bestelbon alg.'!J20=0,\"\",'bestelbon alg.'!J20))","v":""},{"$f":"IF(B67=\"\",\"\",produkten!A108)","v":""},{"$f":"IF(B67=\"\",\"\",produkten!B108)","v":""},{"$f":"'bestelbon alg.'!F20","v":"Radicchio"},null,null,null,"FOUT"]
[{"$f":"IF(B68=\"\",\"\",VLOOKUP(C68,produkten!$A$1:$C$201,3,FALSE))","v":""},{"$f":"IF('bestelbon alg.'!J21=\"\",\"\",IF('bestelbon alg.'!J21=0,\"\",'bestelbon alg.'!J21))","v":""},{"$f":"IF(B68=\"\",\"\",produkten!A109)","v":""},{"$f":"IF(B68=\"\",\"\",produkten!B109)","v":""},{"$f":"'bestelbon alg.'!F21","v":"Chinese kool - Chou Chinois"},null,null,null,"FOUT"]
[{"$f":"IF(B69=\"\",\"\",VLOOKUP(C69,produkten!$A$1:$C$201,3,FALSE))","v":""},{"$f":"IF('bestelbon alg.'!J22=\"\",\"\",IF('bestelbon alg.'!J22=0,\"\",'bestelbon alg.'!J22))","v":""},{"$f":"IF(B69=\"\",\"\",produkten!A110)","v":""},{"$f":"IF(B69=\"\",\"\",produkten!B110)","v":""},{"$f":"'bestelbon alg.'!F22","v":"Paksoi"},null,null,null,"FOUT"]
[{"$f":"IF(B70=\"\",\"\",VLOOKUP(C70,produkten!$A$1:$C$201,3,FALSE))","v":""},{"$f":"IF('bestelbon alg.'!J23=\"\",\"\",IF('bestelbon alg.'!J23=0,\"\",'bestelbon alg.'!J23))","v":""},{"$f":"IF(B70=\"\",\"\",produkten!A111)","v":""},{"$f":"IF(B70=\"\",\"\",produkten!B111)","v":""},{"$f":"'bestelbon alg.'!F23","v":"Rode Biet - Betterave rouge"},null,null,null,"FOUT"]
[{"$f":"IF(B71=\"\",\"\",VLOOKUP(C71,produkten!$A$1:$C$201,3,FALSE))","v":""},{"$f":"IF('bestelbon alg.'!J24=\"\",\"\",IF('bestelbon alg.'!J24=0,\"\",'bestelbon alg.'!J24))","v":""},{"$f":"IF(B71=\"\",\"\",produkten!A112)","v":""},{"$f":"IF(B71=\"\",\"\",produkten!B112)","v":""},{"$f":"'bestelbon alg.'!F24","v":"Koolrabi - Chou Rave"},null,null,null,{"$f":"IF(E71=C71,\"ok\",\"FOUT\")","v":"FOUT"}]
[{"$f":"IF(B72=\"\",\"\",VLOOKUP(C72,produkten!$A$1:$C$201,3,FALSE))","v":""},{"$f":"IF('bestelbon alg.'!J25=\"\",\"\",IF('bestelbon alg.'!J25=0,\"\",'bestelbon alg.'!J25))","v":""},{"$f":"IF(B72=\"\",\"\",produkten!A113)","v":""},{"$f":"IF(B72=\"\",\"\",produkten!B113)","v":""},{"$f":"'bestelbon alg.'!F25","v":"Lente-Ui  -  Oignons Blancs"},null,null,null,"FOUT"]
[{"$f":"IF(B73=\"\",\"\",VLOOKUP(C73,produkten!$A$1:$C$201,3,FALSE))","v":""},{"$f":"IF('bestelbon alg.'!J26=\"\",\"\",IF('bestelbon alg.'!J26=0,\"\",'bestelbon alg.'!J26))","v":""},{"$f":"IF(B73=\"\",\"\",produkten!A114)","v":""},{"$f":"IF(B73=\"\",\"\",produkten!B114)","v":""},{"$f":"'bestelbon alg.'!F26","v":"Rode Ui - Oignons Rouges"},null,null,null,"FOUT"]
[{"$f":"IF(B74=\"\",\"\",VLOOKUP(C74,produkten!$A$1:$C$201,3,FALSE))","v":""},{"$f":"IF('bestelbon alg.'!J27=\"\",\"\",IF('bestelbon alg.'!J27=0,\"\",'bestelbon alg.'!J27))","v":""},{"$f":"IF(B74=\"\",\"\",produkten!A115)","v":""},{"$f":"IF(B74=\"\",\"\",produkten!B115)","v":""},{"$f":"'bestelbon alg.'!F27","v":"Bloemkool - Chou fleur F1"},null,null,null,"FOUT"]
[{"$f":"IF(B75=\"\",\"\",VLOOKUP(C75,produkten!$A$1:$C$201,3,FALSE))","v":""},{"$f":"IF('bestelbon alg.'!J28=\"\",\"\",IF('bestelbon alg.'!J28=0,\"\",'bestelbon alg.'!J28))","v":""},{"$f":"IF(B75=\"\",\"\",produkten!A116)","v":""},{"$f":"IF(B75=\"\",\"\",produkten!B116)","v":""},{"$f":"'bestelbon alg.'!F28","v":"Spruitkool - Chou de Bruxelles F1"},null,null,null,"FOUT"]
[{"$f":"IF(B76=\"\",\"\",VLOOKUP(C76,produkten!$A$1:$C$201,3,FALSE))","v":""},{"$f":"IF('bestelbon alg.'!J29=\"\",\"\",IF('bestelbon alg.'!J29=0,\"\",'bestelbon alg.'!J29))","v":""},{"$f":"IF(B76=\"\",\"\",produkten!A117)","v":""},{"$f":"IF(B76=\"\",\"\",produkten!B117)","v":""},{"$f":"'bestelbon alg.'!F29","v":"Savooikool - Chou Milan"},null,null,null,"FOUT"]
[{"$f":"IF(B77=\"\",\"\",VLOOKUP(C77,produkten!$A$1:$C$201,3,FALSE))","v":""},{"$f":"IF('bestelbon alg.'!J30=\"\",\"\",IF('bestelbon alg.'!J30=0,\"\",'bestelbon alg.'!J30))","v":""},{"$f":"IF(B77=\"\",\"\",produkten!A118)","v":""},{"$f":"IF(B77=\"\",\"\",produkten!B118)","v":""},{"$f":"'bestelbon alg.'!F30","v":"Rode kool - Chou rouge F1"},null,null,null,"FOUT"]
[{"$f":"IF(B78=\"\",\"\",VLOOKUP(C78,produkten!$A$1:$C$201,3,FALSE))","v":""},{"$f":"IF('bestelbon alg.'!J31=\"\",\"\",IF('bestelbon alg.'!J31=0,\"\",'bestelbon alg.'!J31))","v":""},{"$f":"IF(B78=\"\",\"\",produkten!A119)","v":""},{"$f":"IF(B78=\"\",\"\",produkten!B119)","v":""},{"$f":"'bestelbon alg.'!F31","v":"Witte kool - Chou blanc F1"},null,null,null,"FOUT"]
[{"$f":"IF(B79=\"\",\"\",VLOOKUP(C79,produkten!$A$1:$C$201,3,FALSE))","v":""},{"$f":"IF('bestelbon alg.'!J32=\"\",\"\",IF('bestelbon alg.'!J32=0,\"\",'bestelbon alg.'!J32))","v":""},{"$f":"IF(B79=\"\",\"\",produkten!A120)","v":""},{"$f":"IF(B79=\"\",\"\",produkten!B120)","v":""},{"$f":"'bestelbon alg.'!F32","v":"Spitskool - Chou pointu F1"},null,null,null,"FOUT"]
[{"$f":"IF(B80=\"\",\"\",VLOOKUP(C80,produkten!$A$1:$C$201,3,FALSE))","v":""},{"$f":"IF('bestelbon alg.'!J33=\"\",\"\",IF('bestelbon alg.'!J33=0,\"\",'bestelbon alg.'!J33))","v":""},{"$f":"IF(B80=\"\",\"\",produkten!A121)","v":""},{"$f":"IF(B80=\"\",\"\",produkten!B121)","v":""},{"$f":"'bestelbon alg.'!F33","v":"Broccoli - Chou Brocoli F1"},null,null,null,"FOUT"]
[{"$f":"IF(B81=\"\",\"\",VLOOKUP(C81,produkten!$A$1:$C$201,3,FALSE))","v":""},{"$f":"IF('bestelbon alg.'!J34=\"\",\"\",IF('bestelbon alg.'!J34=0,\"\",'bestelbon alg.'!J34))","v":""},{"$f":"IF(B81=\"\",\"\",produkten!A122)","v":""},{"$f":"IF(B81=\"\",\"\",produkten!B122)","v":""},{"$f":"'bestelbon alg.'!F34","v":"Boerenkool - Chou frisé F1"},null,null,null,"FOUT"]
[{"$f":"IF(B82=\"\",\"\",VLOOKUP(C82,produkten!$A$1:$C$201,3,FALSE))","v":""},{"$f":"IF('bestelbon alg.'!J35=\"\",\"\",IF('bestelbon alg.'!J35=0,\"\",'bestelbon alg.'!J35))","v":""},{"$f":"IF(B82=\"\",\"\",produkten!A123)","v":""},{"$f":"IF(B82=\"\",\"\",produkten!B123)","v":""},{"$f":"'bestelbon alg.'!F35","v":"Torentjesbloemkool - Chou Romanesco"},null,null,null,"FOUT"]
[{"$f":"IF(B83=\"\",\"\",VLOOKUP(C83,produkten!$A$1:$C$201,3,FALSE))","v":""},{"$f":"IF('bestelbon alg.'!J36=\"\",\"\",IF('bestelbon alg.'!J36=0,\"\",'bestelbon alg.'!J36))","v":""},{"$f":"IF(B83=\"\",\"\",produkten!A124)","v":""},{"$f":"IF(B83=\"\",\"\",produkten!B124)","v":""},{"$f":"'bestelbon alg.'!F36","v":"Andijvie  -  Scarole"},null,null,null,"FOUT"]
[{"$f":"IF(B84=\"\",\"\",VLOOKUP(C84,produkten!$A$1:$C$201,3,FALSE))","v":""},{"$f":"IF('bestelbon alg.'!J37=\"\",\"\",IF('bestelbon alg.'!J37=0,\"\",'bestelbon alg.'!J37))","v":""},{"$f":"IF(B84=\"\",\"\",produkten!A125)","v":""},{"$f":"IF(B84=\"\",\"\",produkten!B125)","v":""},{"$f":"'bestelbon alg.'!F37","v":"Krulandijvie - Fine maraîchère"},null,null,null,"FOUT"]
[{"$f":"IF(B85=\"\",\"\",VLOOKUP(C85,produkten!$A$1:$C$201,3,FALSE))","v":""},{"$f":"IF('bestelbon alg.'!J38=\"\",\"\",IF('bestelbon alg.'!J38=0,\"\",'bestelbon alg.'!J38))","v":""},{"$f":"IF(B85=\"\",\"\",produkten!A126)","v":""},{"$f":"IF(B85=\"\",\"\",produkten!B126)","v":""},{"$f":"'bestelbon alg.'!F38","v":"Kropsla  -  Laitue"},null,null,null,"FOUT"]
[{"$f":"IF(B86=\"\",\"\",VLOOKUP(C86,produkten!$A$1:$C$201,3,FALSE))","v":""},{"$f":"IF('bestelbon alg.'!J39=\"\",\"\",IF('bestelbon alg.'!J39=0,\"\",'bestelbon alg.'!J39))","v":""},{"$f":"IF(B86=\"\",\"\",produkten!A127)","v":""},{"$f":"IF(B86=\"\",\"\",produkten!B127)","v":""},{"$f":"'bestelbon alg.'!F39","v":"Serresla - Laitue de serre"},null,null,null,"FOUT"]
[{"$f":"IF(B87=\"\",\"\",VLOOKUP(C87,produkten!$A$1:$C$201,3,FALSE))","v":""},{"$f":"IF('bestelbon alg.'!J40=\"\",\"\",IF('bestelbon alg.'!J40=0,\"\",'bestelbon alg.'!J40))","v":""},{"$f":"IF(B87=\"\",\"\",produkten!A128)","v":""},{"$f":"IF(B87=\"\",\"\",produkten!B129)","v":""},{"$f":"'bestelbon alg.'!F40","v":"Sla - 5 cm (serre)"},null,null,null,"FOUT"]
[{"$f":"IF(B88=\"\",\"\",VLOOKUP(C88,produkten!$A$1:$C$201,3,FALSE))","v":""},{"$f":"IF('bestelbon alg.'!J41=\"\",\"\",IF('bestelbon alg.'!J41=0,\"\",'bestelbon alg.'!J41))","v":""},{"$f":"IF(B88=\"\",\"\",produkten!A129)","v":""},{"$f":"IF(B88=\"\",\"\",produkten!B130)","v":""},{"$f":"'bestelbon alg.'!F41","v":"Sla - Laitue 'Lollo Rossa'"},null,null,null,"FOUT"]
[{"$f":"IF(B89=\"\",\"\",VLOOKUP(C89,produkten!$A$1:$C$201,3,FALSE))","v":""},{"$f":"IF('bestelbon alg.'!J42=\"\",\"\",IF('bestelbon alg.'!J42=0,\"\",'bestelbon alg.'!J42))","v":""},{"$f":"IF(B89=\"\",\"\",produkten!A130)","v":""},{"$f":"IF(B89=\"\",\"\",produkten!B131)","v":""},{"$f":"'bestelbon alg.'!F42","v":"Sla - Laitue 'Lollo Verto'"},null,null,null,"FOUT"]
[{"$f":"IF(B90=\"\",\"\",VLOOKUP(C90,produkten!$A$1:$C$201,3,FALSE))","v":""},{"$f":"IF('bestelbon alg.'!J43=\"\",\"\",IF('bestelbon alg.'!J43=0,\"\",'bestelbon alg.'!J43))","v":""},{"$f":"IF(B90=\"\",\"\",produkten!A131)","v":""},{"$f":"IF(B90=\"\",\"\",produkten!B132)","v":""},{"$f":"'bestelbon alg.'!F43","v":"4-seizoenen sla  -  Laitue 4-saisons"},null,null,null,"FOUT"]
[{"$f":"IF(B91=\"\",\"\",VLOOKUP(C91,produkten!$A$1:$C$201,3,FALSE))","v":""},{"$f":"IF('bestelbon alg.'!J44=\"\",\"\",IF('bestelbon alg.'!J44=0,\"\",'bestelbon alg.'!J44))","v":""},{"$f":"IF(B91=\"\",\"\",produkten!A132)","v":""},{"$f":"IF(B91=\"\",\"\",produkten!B133)","v":""},{"$f":"'bestelbon alg.'!F44","v":"Eikenbladsla  - Laitue feuille de chêne"},null,null,null,"FOUT"]
[{"$f":"IF(B92=\"\",\"\",VLOOKUP(C92,produkten!$A$1:$C$201,3,FALSE))","v":""},{"$f":"IF('bestelbon alg.'!J45=\"\",\"\",IF('bestelbon alg.'!J45=0,\"\",'bestelbon alg.'!J45))","v":""},{"$f":"IF(B92=\"\",\"\",produkten!A133)","v":""},{"$f":"IF(B92=\"\",\"\",produkten!B134)","v":""},{"$f":"'bestelbon alg.'!F45","v":"Eikenbladsla groen -  Feuillle de chêne vert"},null,null,null,"FOUT"]
[{"$f":"IF(B93=\"\",\"\",VLOOKUP(C93,produkten!$A$1:$C$201,3,FALSE))","v":""},{"$f":"IF('bestelbon alg.'!J46=\"\",\"\",IF('bestelbon alg.'!J46=0,\"\",'bestelbon alg.'!J46))","v":""},{"$f":"IF(B93=\"\",\"\",produkten!A134)","v":""},{"$f":"IF(B93=\"\",\"\",produkten!B135)","v":""},{"$f":"'bestelbon alg.'!F46","v":"Romeinse  sla -  Laitue Romaine"},null,null,null,"FOUT"]
[{"$f":"IF(B94=\"\",\"\",VLOOKUP(C94,produkten!$A$1:$C$201,3,FALSE))","v":""},{"$f":"IF('bestelbon alg.'!J47=\"\",\"\",IF('bestelbon alg.'!J47=0,\"\",'bestelbon alg.'!J47))","v":""},{"$f":"IF(B94=\"\",\"\",produkten!A135)","v":""},{"$f":"IF(B94=\"\",\"\",produkten!B136)","v":""},{"$f":"'bestelbon alg.'!F47","v":"Ijsberg sla  - Laitue iceberg"},null,null,null,"FOUT"]
[{"$f":"IF(B95=\"\",\"\",VLOOKUP(C95,produkten!$A$1:$C$201,3,FALSE))","v":""},{"$f":"IF('bestelbon alg.'!J48=\"\",\"\",IF('bestelbon alg.'!J48=0,\"\",'bestelbon alg.'!J48))","v":""},{"$f":"IF(B95=\"\",\"\",produkten!A136)","v":""},{"$f":"IF(B95=\"\",\"\",produkten!B137)","v":""},{"$f":"'bestelbon alg.'!F48","v":"Batavia rood  -  rouge"},null,null,null,"FOUT"]
[{"$f":"IF(B96=\"\",\"\",VLOOKUP(C96,produkten!$A$1:$C$201,3,FALSE))","v":""},{"$f":"IF('bestelbon alg.'!J49=\"\",\"\",IF('bestelbon alg.'!J49=0,\"\",'bestelbon alg.'!J49))","v":""},{"$f":"IF(B96=\"\",\"\",produkten!A137)","v":""},{"$f":"IF(B96=\"\",\"\",produkten!B138)","v":""},{"$f":"'bestelbon alg.'!F49","v":"Batavia groen  -  vert"},null,null,null,"FOUT"]
[{"$f":"IF(B97=\"\",\"\",VLOOKUP(C97,produkten!$A$1:$C$201,3,FALSE))","v":""},{"$f":"IF('bestelbon alg.'!J50=\"\",\"\",IF('bestelbon alg.'!J50=0,\"\",'bestelbon alg.'!J50))","v":""},{"$f":"IF(B97=\"\",\"\",produkten!A138)","v":""},{"$f":"IF(B97=\"\",\"\",produkten!B139)","v":""},{"$f":"'bestelbon alg.'!F50","v":"Veldsla - Mâches"},null,null,null,"FOUT"]
[{"$f":"IF(B98=\"\",\"\",VLOOKUP(C98,produkten!$A$1:$C$201,3,FALSE))","v":""},{"$f":"IF('bestelbon alg.'!J51=\"\",\"\",IF('bestelbon alg.'!J51=0,\"\",'bestelbon alg.'!J51))","v":""},{"$f":"IF(B98=\"\",\"\",produkten!A139)","v":""},{"$f":"IF(B98=\"\",\"\",produkten!B140)","v":""},{"$f":"'bestelbon alg.'!F51","v":"Spinazie - Épinards"},null,null,null,"FOUT"]
[{"$f":"IF(B99=\"\",\"\",VLOOKUP(C99,produkten!$A$1:$C$201,3,FALSE))","v":""},{"$f":"IF('bestelbon alg.'!J52=\"\",\"\",IF('bestelbon alg.'!J52=0,\"\",'bestelbon alg.'!J52))","v":""},{"$f":"IF(B99=\"\",\"\",produkten!A140)","v":""},{"$f":"IF(B99=\"\",\"\",produkten!B140)","v":""},{"$f":"'bestelbon alg.'!F52","v":"Winterbloemkool-Chou fleur d'hiver"},null,null,null,"FOUT"]
[{"$f":"IF(B100=\"\",\"\",VLOOKUP(C100,produkten!$A$1:$C$201,3,FALSE))","v":""},{"$f":"IF('bestelbon alg.'!J53=\"\",\"\",IF('bestelbon alg.'!J53=0,\"\",'bestelbon alg.'!J53))","v":""},{"$f":"IF(B100=\"\",\"\",produkten!A141)","v":""},{"$f":"IF(B100=\"\",\"\",produkten!B141)","v":""},{"$f":"'bestelbon alg.'!F53","v":"Vroege kool - Chou fleur primeur"},null,null,null,"FOUT"]
[{"$f":"IF(B101=\"\",\"\",VLOOKUP(C101,produkten!$A$1:$C$201,3,FALSE))","v":""},{"$f":"IF('bestelbon alg.'!J54=\"\",\"\",IF('bestelbon alg.'!J54=0,\"\",'bestelbon alg.'!J54))","v":""},{"$f":"IF(B101=\"\",\"\",produkten!A143)","v":""},{"$f":"IF(B101=\"\",\"\",produkten!B143)","v":""},{"$f":"'bestelbon alg.'!F54","v":"Winter Prei Pak - Poireau d'hiver botte (20x50)*"},null,null,null,{"$f":"IF(E101=C101,\"ok\",\"FOUT\")","v":"FOUT"}]
[{"$f":"IF(B102=\"\",\"\",VLOOKUP(C102,produkten!$A$50:$C$201,3,FALSE))","v":""},{"$f":"IF('bestelbon alg.'!J57=\"\",\"\",IF('bestelbon alg.'!J57=0,\"\",'bestelbon alg.'!J57))","v":""},{"$f":"IF(B102=\"\",\"\",produkten!A144)","v":""},{"$f":"IF(B102=\"\",\"\",produkten!B144)","v":""},{"$f":"'bestelbon alg.'!F57","v":"Cherrytomaat - Tomate apéritif"},null,null,null,{"$f":"IF(E102=C102,\"ok\",\"FOUT\")","v":"FOUT"}]
[{"$f":"IF(B103=\"\",\"\",VLOOKUP(C103,produkten!$A$1:$C$201,3,FALSE))","v":""},{"$f":"IF('bestelbon alg.'!J58=\"\",\"\",IF('bestelbon alg.'!J58=0,\"\",'bestelbon alg.'!J58))","v":""},{"$f":"IF(B103=\"\",\"\",produkten!A145)","v":""},{"$f":"IF(B103=\"\",\"\",produkten!B145)","v":""},{"$f":"'bestelbon alg.'!F58","v":"Paprika rood  -  Poivron rouge"},null,null,null,{"$f":"IF(E103=C103,\"ok\",\"FOUT\")","v":"FOUT"}]
[{"$f":"IF(B104=\"\",\"\",VLOOKUP(C104,produkten!$A$1:$C$201,3,FALSE))","v":""},{"$f":"IF('bestelbon alg.'!J59=\"\",\"\",IF('bestelbon alg.'!J59=0,\"\",'bestelbon alg.'!J59))","v":""},{"$f":"IF(B104=\"\",\"\",produkten!A146)","v":""},{"$f":"IF(B104=\"\",\"\",produkten!B146)","v":""},{"$f":"'bestelbon alg.'!F59","v":"Peper rood - Piment rouge"},null,null,null,"FOUT"]
[{"$f":"IF(B105=\"\",\"\",VLOOKUP(C105,produkten!$A$1:$C$201,3,FALSE))","v":""},{"$f":"IF('bestelbon alg.'!J60=\"\",\"\",IF('bestelbon alg.'!J60=0,\"\",'bestelbon alg.'!J60))","v":""},{"$f":"IF(B105=\"\",\"\",produkten!A147)","v":""},{"$f":"IF(B105=\"\",\"\",produkten!B147)","v":""},{"$f":"'bestelbon alg.'!F60","v":"Peper geel - Piment jaune"},null,null,null,"FOUT"]
[{"$f":"IF(B106=\"\",\"\",VLOOKUP(C106,produkten!$A$1:$C$201,3,FALSE))","v":""},{"$f":"IF('bestelbon alg.'!J61=\"\",\"\",IF('bestelbon alg.'!J61=0,\"\",'bestelbon alg.'!J61))","v":""},{"$f":"IF(B106=\"\",\"\",produkten!A148)","v":""},{"$f":"IF(B106=\"\",\"\",produkten!B148)","v":""},{"$f":"'bestelbon alg.'!F61","v":"Snack komkommer - Concombre snack"},null,null,null,"FOUT"]
[{"$f":"IF(B107=\"\",\"\",VLOOKUP(C107,produkten!$A$1:$C$201,3,FALSE))","v":""},{"$f":"IF('bestelbon alg.'!J62=\"\",\"\",IF('bestelbon alg.'!J62=0,\"\",'bestelbon alg.'!J62))","v":""},{"$f":"IF(B107=\"\",\"\",produkten!A149)","v":""},{"$f":"IF(B107=\"\",\"\",produkten!B149)","v":""},{"$f":"'bestelbon alg.'!F62","v":"Peper 'Torito' rood - Piment rouge 'Torito'"},null,null,null,"FOUT"]
[{"$f":"IF(B108=\"\",\"\",VLOOKUP(C108,produkten!$A$1:$C$201,3,FALSE))","v":""},{"$f":"IF('bestelbon alg.'!J63=\"\",\"\",IF('bestelbon alg.'!J63=0,\"\",'bestelbon alg.'!J63))","v":""},{"$f":"IF(B108=\"\",\"\",produkten!A150)","v":""},{"$f":"IF(B108=\"\",\"\",produkten!B150)","v":""},{"$f":"'bestelbon alg.'!F63","v":"Snack paprika rood - poivron snack rouge"},null,null,null,"FOUT"]
[{"$f":"IF(B109=\"\",\"\",VLOOKUP(C109,produkten!$A$1:$C$201,3,FALSE))","v":""},{"$f":"IF('bestelbon alg.'!J64=\"\",\"\",IF('bestelbon alg.'!J64=0,\"\",'bestelbon alg.'!J64))","v":""},{"$f":"IF(B109=\"\",\"\",produkten!A151)","v":""},{"$f":"IF(B109=\"\",\"\",produkten!B151)","v":""},{"$f":"'bestelbon alg.'!F64","v":"Snack paprika oranje - poivron snack orange"},null,null,null,"FOUT"]
[{"$f":"IF(B110=\"\",\"\",VLOOKUP(C110,produkten!$A$1:$C$201,3,FALSE))","v":""},{"$f":"IF('bestelbon alg.'!J65=\"\",\"\",IF('bestelbon alg.'!J65=0,\"\",'bestelbon alg.'!J65))","v":""},{"$f":"IF(B110=\"\",\"\",produkten!A152)","v":""},{"$f":"IF(B110=\"\",\"\",produkten!B152)","v":""},{"$f":"'bestelbon alg.'!F65","v":"Snack paprika geel - poivron snack jaune"},null,null,null,"FOUT"]
[{"$f":"IF(B111=\"\",\"\",VLOOKUP(C111,produkten!$A$1:$C$201,3,FALSE))","v":""},{"$f":"IF('bestelbon alg.'!D78=\"\",\"\",IF('bestelbon alg.'!D78=0,\"\",'bestelbon alg.'!D78))","v":""},{"$f":"IF(B111=\"\",\"\",produkten!A54)","v":""},{"$f":"IF(B111=\"\",\"\",produkten!B54)","v":""},{"$f":"'bestelbon alg.'!A78","v":"Aztekenkruid (Honingverbena) - L'herbe sucrée des Aztéques"},null,null,null,{"$f":"IF(E111=C111,\"ok\",\"FOUT\")","v":"FOUT"}]
[{"$f":"IF(B112=\"\",\"\",VLOOKUP(C112,produkten!$A$1:$C$201,3,FALSE))","v":""},{"$f":"IF('bestelbon alg.'!D80=\"\",\"\",IF('bestelbon alg.'!D80=0,\"\",'bestelbon alg.'!D80))","v":""},{"$f":"IF(B112=\"\",\"\",produkten!A55)","v":""},{"$f":"IF(B112=\"\",\"\",produkten!B55)","v":""},{"$f":"'bestelbon alg.'!A80","v":"Basilicum - Basilic"},null,null,null,"FOUT"]
[{"$f":"IF(B113=\"\",\"\",VLOOKUP(C113,produkten!$A$1:$C$201,3,FALSE))","v":""},{"$f":"IF('bestelbon alg.'!D81=\"\",\"\",IF('bestelbon alg.'!D81=0,\"\",'bestelbon alg.'!D81))","v":""},{"$f":"IF(B113=\"\",\"\",produkten!A56)","v":""},{"$f":"IF(B113=\"\",\"\",produkten!B56)","v":""},{"$f":"'bestelbon alg.'!A81","v":"Basilicum Citroen - Basilic Citron"},null,null,null,"FOUT"]
[{"$f":"IF(B114=\"\",\"\",VLOOKUP(C114,produkten!$A$1:$C$201,3,FALSE))","v":""},{"$f":"IF('bestelbon alg.'!D82=\"\",\"\",IF('bestelbon alg.'!D82=0,\"\",'bestelbon alg.'!D82))","v":""},{"$f":"IF(B114=\"\",\"\",produkten!A57)","v":""},{"$f":"IF(B114=\"\",\"\",produkten!B57)","v":""},{"$f":"'bestelbon alg.'!A82","v":"Basilicum Rood - Basilic Rouge"},null,null,null,"FOUT"]
[{"$f":"IF(B115=\"\",\"\",VLOOKUP(C115,produkten!$A$1:$C$201,3,FALSE))","v":""},{"$f":"IF('bestelbon alg.'!D83=\"\",\"\",IF('bestelbon alg.'!D83=0,\"\",'bestelbon alg.'!D83))","v":""},{"$f":"IF(B115=\"\",\"\",produkten!A58)","v":""},{"$f":"IF(B115=\"\",\"\",produkten!B58)","v":""},{"$f":"'bestelbon alg.'!A83","v":"Basilicum struik - Basilic Fine vert"},null,null,null,"FOUT"]
[{"$f":"IF(B116=\"\",\"\",VLOOKUP(C116,produkten!$A$1:$C$201,3,FALSE))","v":""},{"$f":"IF('bestelbon alg.'!D84=\"\",\"\",IF('bestelbon alg.'!D84=0,\"\",'bestelbon alg.'!D84))","v":""},{"$f":"IF(B116=\"\",\"\",produkten!A59)","v":""},{"$f":"IF(B116=\"\",\"\",produkten!B59)","v":""},{"$f":"'bestelbon alg.'!A84","v":"Basilicum Thaise - Basilic Thai"},null,null,null,"FOUT"]
[{"$f":"IF(B117=\"\",\"\",VLOOKUP(C117,produkten!$A$1:$C$201,3,FALSE))","v":""},{"$f":"IF('bestelbon alg.'!D85=\"\",\"\",IF('bestelbon alg.'!D85=0,\"\",'bestelbon alg.'!D85))","v":""},{"$f":"IF(B117=\"\",\"\",produkten!A60)","v":""},{"$f":"IF(B117=\"\",\"\",produkten!B60)","v":""},{"$f":"'bestelbon alg.'!A85","v":"Bieslook - Ciboulette"},null,null,null,"FOUT"]
[{"$f":"IF(B118=\"\",\"\",VLOOKUP(C118,produkten!$A$1:$C$201,3,FALSE))","v":""},{"$f":"IF('bestelbon alg.'!D86=\"\",\"\",IF('bestelbon alg.'!D86=0,\"\",'bestelbon alg.'!D86))","v":""},{"$f":"IF(B118=\"\",\"\",produkten!A61)","v":""},{"$f":"IF(B118=\"\",\"\",produkten!B61)","v":""},{"$f":"'bestelbon alg.'!A86","v":"Chinese bieslook - Ciboule de Chine"},null,null,null,"FOUT"]
[{"$f":"IF(B119=\"\",\"\",VLOOKUP(C119,produkten!$A$1:$C$201,3,FALSE))","v":""},{"$f":"IF('bestelbon alg.'!D87=\"\",\"\",IF('bestelbon alg.'!D87=0,\"\",'bestelbon alg.'!D87))","v":""},{"$f":"IF(B119=\"\",\"\",produkten!A62)","v":""},{"$f":"IF(B119=\"\",\"\",produkten!B62)","v":""},{"$f":"'bestelbon alg.'!A87","v":"Bloedzuring - Oseille Sanguine"},null,null,null,"FOUT"]
[{"$f":"IF(B120=\"\",\"\",VLOOKUP(C120,produkten!$A$1:$C$201,3,FALSE))","v":""},{"$f":"IF('bestelbon alg.'!D88=\"\",\"\",IF('bestelbon alg.'!D88=0,\"\",'bestelbon alg.'!D88))","v":""},{"$f":"IF(B120=\"\",\"\",produkten!A63)","v":""},{"$f":"IF(B120=\"\",\"\",produkten!B63)","v":""},{"$f":"'bestelbon alg.'!A88","v":"Bonenkruid - Sariette"},null,null,null,"FOUT"]
[{"$f":"IF(B121=\"\",\"\",VLOOKUP(C121,produkten!$A$1:$C$201,3,FALSE))","v":""},{"$f":"IF('bestelbon alg.'!D89=\"\",\"\",IF('bestelbon alg.'!D89=0,\"\",'bestelbon alg.'!D89))","v":""},{"$f":"IF(B121=\"\",\"\",produkten!A64)","v":""},{"$f":"IF(B121=\"\",\"\",produkten!B64)","v":""},{"$f":"'bestelbon alg.'!A89","v":"Citroengras - Citronelle de l'Inde"},null,null,null,"FOUT"]
[{"$f":"IF(B122=\"\",\"\",VLOOKUP(C122,produkten!$A$1:$C$201,3,FALSE))","v":""},{"$f":"IF('bestelbon alg.'!D90=\"\",\"\",IF('bestelbon alg.'!D90=0,\"\",'bestelbon alg.'!D90))","v":""},{"$f":"IF(B122=\"\",\"\",produkten!A65)","v":""},{"$f":"IF(B122=\"\",\"\",produkten!B65)","v":""},{"$f":"'bestelbon alg.'!A90","v":"Citroenmelisse - Mélisse de citron"},null,null,null,"FOUT"]
[{"$f":"IF(B123=\"\",\"\",VLOOKUP(C123,produkten!$A$1:$C$201,3,FALSE))","v":""},{"$f":"IF('bestelbon alg.'!D91=\"\",\"\",IF('bestelbon alg.'!D91=0,\"\",'bestelbon alg.'!D91))","v":""},{"$f":"IF(B123=\"\",\"\",produkten!A66)","v":""},{"$f":"IF(B123=\"\",\"\",produkten!B66)","v":""},{"$f":"'bestelbon alg.'!A91","v":"Citroenverbena - Verveine Citronelle"},null,null,null,"FOUT"]
[{"$f":"IF(B124=\"\",\"\",VLOOKUP(C124,produkten!$A$1:$C$201,3,FALSE))","v":""},{"$f":"IF('bestelbon alg.'!D92=\"\",\"\",IF('bestelbon alg.'!D92=0,\"\",'bestelbon alg.'!D92))","v":""},{"$f":"IF(B124=\"\",\"\",produkten!A67)","v":""},{"$f":"IF(B124=\"\",\"\",produkten!B67)","v":""},{"$f":"'bestelbon alg.'!A92","v":"Colakruid - Cola-végétal"},null,null,null,"FOUT"]
[{"$f":"IF(B125=\"\",\"\",VLOOKUP(C125,produkten!$A$1:$C$201,3,FALSE))","v":""},{"$f":"IF('bestelbon alg.'!D93=\"\",\"\",IF('bestelbon alg.'!D93=0,\"\",'bestelbon alg.'!D93))","v":""},{"$f":"IF(B125=\"\",\"\",produkten!A68)","v":""},{"$f":"IF(B125=\"\",\"\",produkten!B68)","v":""},{"$f":"'bestelbon alg.'!A93","v":"Kerrieplant - Plante à Curry"},null,null,null,"FOUT"]
[{"$f":"IF(B126=\"\",\"\",VLOOKUP(C126,produkten!$A$1:$C$201,3,FALSE))","v":""},{"$f":"IF('bestelbon alg.'!D94=\"\",\"\",IF('bestelbon alg.'!D94=0,\"\",'bestelbon alg.'!D94))","v":""},{"$f":"IF(B126=\"\",\"\",produkten!A69)","v":""},{"$f":"IF(B126=\"\",\"\",produkten!B69)","v":""},{"$f":"'bestelbon alg.'!A94","v":"Dille - Aneth"},null,null,null,"FOUT"]
[{"$f":"IF(B127=\"\",\"\",VLOOKUP(C127,produkten!$A$1:$C$201,3,FALSE))","v":""},{"$f":"IF('bestelbon alg.'!D95=\"\",\"\",IF('bestelbon alg.'!D95=0,\"\",'bestelbon alg.'!D95))","v":""},{"$f":"IF(B127=\"\",\"\",produkten!A70)","v":""},{"$f":"IF(B127=\"\",\"\",produkten!B70)","v":""},{"$f":"'bestelbon alg.'!A95","v":"Dragon - Estragon"},null,null,null,"FOUT"]
[{"$f":"IF(B128=\"\",\"\",VLOOKUP(C128,produkten!$A$1:$C$201,3,FALSE))","v":""},{"$f":"IF('bestelbon alg.'!D96=\"\",\"\",IF('bestelbon alg.'!D96=0,\"\",'bestelbon alg.'!D96))","v":""},{"$f":"IF(B128=\"\",\"\",produkten!A71)","v":""},{"$f":"IF(B128=\"\",\"\",produkten!B71)","v":""},{"$f":"'bestelbon alg.'!A96","v":"Kamille - Camomille"},null,null,null,"FOUT"]
[{"$f":"IF(B129=\"\",\"\",VLOOKUP(C129,produkten!$A$1:$C$201,3,FALSE))","v":""},{"$f":"IF('bestelbon alg.'!D97=\"\",\"\",IF('bestelbon alg.'!D97=0,\"\",'bestelbon alg.'!D97))","v":""},{"$f":"IF(B129=\"\",\"\",produkten!A72)","v":""},{"$f":"IF(B129=\"\",\"\",produkten!B72)","v":""},{"$f":"'bestelbon alg.'!A97","v":"Kervel - Cerfeuil"},null,null,null,"FOUT"]
[{"$f":"IF(B130=\"\",\"\",VLOOKUP(C130,produkten!$A$1:$C$201,3,FALSE))","v":""},{"$f":"IF('bestelbon alg.'!D98=\"\",\"\",IF('bestelbon alg.'!D98=0,\"\",'bestelbon alg.'!D98))","v":""},{"$f":"IF(B130=\"\",\"\",produkten!A73)","v":""},{"$f":"IF(B130=\"\",\"\",produkten!B73)","v":""},{"$f":"'bestelbon alg.'!A98","v":"Koriander - Coriandre"},null,null,null,"FOUT"]
[{"$f":"IF(B131=\"\",\"\",VLOOKUP(C131,produkten!$A$1:$C$201,3,FALSE))","v":""},{"$f":"IF('bestelbon alg.'!D99=\"\",\"\",IF('bestelbon alg.'!D99=0,\"\",'bestelbon alg.'!D99))","v":""},{"$f":"IF(B131=\"\",\"\",produkten!A74)","v":""},{"$f":"IF(B131=\"\",\"\",produkten!B74)","v":""},{"$f":"'bestelbon alg.'!A99","v":"Lavas - Livêche"},null,null,null,"FOUT"]
[{"$f":"IF(B132=\"\",\"\",VLOOKUP(C132,produkten!$A$1:$C$201,3,FALSE))","v":""},{"$f":"IF('bestelbon alg.'!D100=\"\",\"\",IF('bestelbon alg.'!D100=0,\"\",'bestelbon alg.'!D100))","v":""},{"$f":"IF(B132=\"\",\"\",produkten!A75)","v":""},{"$f":"IF(B132=\"\",\"\",produkten!B75)","v":""},{"$f":"'bestelbon alg.'!A100","v":"Marjolein - Marjoleine"},null,null,null,"FOUT"]
[{"$f":"IF(B133=\"\",\"\",VLOOKUP(C133,produkten!$A$1:$C$201,3,FALSE))","v":""},{"$f":"IF('bestelbon alg.'!D101=\"\",\"\",IF('bestelbon alg.'!D101=0,\"\",'bestelbon alg.'!D101))","v":""},{"$f":"IF(B133=\"\",\"\",produkten!A76)","v":""},{"$f":"IF(B133=\"\",\"\",produkten!B76)","v":""},{"$f":"'bestelbon alg.'!A101","v":"Munt 'Aardbei' - Menthe 'fraise'"},null,null,null,"FOUT"]
[{"$f":"IF(B134=\"\",\"\",VLOOKUP(C134,produkten!$A$1:$C$201,3,FALSE))","v":""},{"$f":"IF('bestelbon alg.'!D102=\"\",\"\",IF('bestelbon alg.'!D102=0,\"\",'bestelbon alg.'!D102))","v":""},{"$f":"IF(B134=\"\",\"\",produkten!A77)","v":""},{"$f":"IF(B134=\"\",\"\",produkten!B77)","v":""},{"$f":"'bestelbon alg.'!A102","v":"Munt 'Appel'- Menthe 'Pomme'"},null,null,null,"FOUT"]
[{"$f":"IF(B135=\"\",\"\",VLOOKUP(C135,produkten!$A$1:$C$201,3,FALSE))","v":""},{"$f":"IF('bestelbon alg.'!D103=\"\",\"\",IF('bestelbon alg.'!D103=0,\"\",'bestelbon alg.'!D103))","v":""},{"$f":"IF(B135=\"\",\"\",produkten!A78)","v":""},{"$f":"IF(B135=\"\",\"\",produkten!B78)","v":""},{"$f":"'bestelbon alg.'!A103","v":"Marokkaanse Munt - Menthe Marocaine"},null,null,null,"FOUT"]
[{"$f":"IF(B136=\"\",\"\",VLOOKUP(C136,produkten!$A$1:$C$201,3,FALSE))","v":""},{"$f":"IF('bestelbon alg.'!D104=\"\",\"\",IF('bestelbon alg.'!D104=0,\"\",'bestelbon alg.'!D104))","v":""},{"$f":"IF(B136=\"\",\"\",produkten!A79)","v":""},{"$f":"IF(B136=\"\",\"\",produkten!B79)","v":""},{"$f":"'bestelbon alg.'!A104","v":"Pepermunt - Menthe Poivrée"},null,null,null,"FOUT"]
[{"$f":"IF(B137=\"\",\"\",VLOOKUP(C137,produkten!$A$1:$C$201,3,FALSE))","v":""},{"$f":"IF('bestelbon alg.'!D105=\"\",\"\",IF('bestelbon alg.'!D105=0,\"\",'bestelbon alg.'!D105))","v":""},{"$f":"IF(B137=\"\",\"\",produkten!A80)","v":""},{"$f":"IF(B137=\"\",\"\",produkten!B80)","v":""},{"$f":"'bestelbon alg.'!A105","v":"Olijfkruid - Santolina"},null,null,null,"FOUT"]
[{"$f":"IF(B138=\"\",\"\",VLOOKUP(C138,produkten!$A$1:$C$201,3,FALSE))","v":""},{"$f":"IF('bestelbon alg.'!D106=\"\",\"\",IF('bestelbon alg.'!D106=0,\"\",'bestelbon alg.'!D106))","v":""},{"$f":"IF(B138=\"\",\"\",produkten!A81)","v":""},{"$f":"IF(B138=\"\",\"\",produkten!B81)","v":""},{"$f":"'bestelbon alg.'!A106","v":"Oregano - Origan"},null,null,null,"FOUT"]
[{"$f":"IF(B139=\"\",\"\",VLOOKUP(C139,produkten!$A$1:$C$201,3,FALSE))","v":""},{"$f":"IF('bestelbon alg.'!D107=\"\",\"\",IF('bestelbon alg.'!D107=0,\"\",'bestelbon alg.'!D107))","v":""},{"$f":"IF(B139=\"\",\"\",produkten!A82)","v":""},{"$f":"IF(B139=\"\",\"\",produkten!B82)","v":""},{"$f":"'bestelbon alg.'!A107","v":"Pastinaak - Panais"},null,null,null,"FOUT"]
[{"$f":"IF(B140=\"\",\"\",VLOOKUP(C140,produkten!$A$1:$C$201,3,FALSE))","v":""},{"$f":"IF('bestelbon alg.'!D108=\"\",\"\",IF('bestelbon alg.'!D108=0,\"\",'bestelbon alg.'!D108))","v":""},{"$f":"IF(B140=\"\",\"\",produkten!A83)","v":""},{"$f":"IF(B140=\"\",\"\",produkten!B83)","v":""},{"$f":"'bestelbon alg.'!A108","v":"Peterselie - Persil"},null,null,null,"FOUT"]
[{"$f":"IF(B141=\"\",\"\",VLOOKUP(C141,produkten!$A$1:$C$201,3,FALSE))","v":""},{"$f":"IF('bestelbon alg.'!D109=\"\",\"\",IF('bestelbon alg.'!D109=0,\"\",'bestelbon alg.'!D109))","v":""},{"$f":"IF(B141=\"\",\"\",produkten!A84)","v":""},{"$f":"IF(B141=\"\",\"\",produkten!B84)","v":""},{"$f":"'bestelbon alg.'!A109","v":"Bladpeterselie - Persil Plat"},null,null,null,"FOUT"]
[{"$f":"IF(B142=\"\",\"\",VLOOKUP(C142,produkten!$A$1:$C$201,3,FALSE))","v":""},{"$f":"IF('bestelbon alg.'!D110=\"\",\"\",IF('bestelbon alg.'!D110=0,\"\",'bestelbon alg.'!D110))","v":""},{"$f":"IF(B142=\"\",\"\",produkten!A85)","v":""},{"$f":"IF(B142=\"\",\"\",produkten!B85)","v":""},{"$f":"'bestelbon alg.'!A110","v":"Pluksla - Laitue à couper"},null,null,null,"FOUT"]
[{"$f":"IF(B143=\"\",\"\",VLOOKUP(C143,produkten!$A$1:$C$201,3,FALSE))","v":""},{"$f":"IF('bestelbon alg.'!D111=\"\",\"\",IF('bestelbon alg.'!D111=0,\"\",'bestelbon alg.'!D111))","v":""},{"$f":"IF(B143=\"\",\"\",produkten!A86)","v":""},{"$f":"IF(B143=\"\",\"\",produkten!B86)","v":""},{"$f":"'bestelbon alg.'!A111","v":"Radijs - Radis"},null,null,null,"FOUT"]
[{"$f":"IF(B144=\"\",\"\",VLOOKUP(C144,produkten!$A$1:$C$201,3,FALSE))","v":""},{"$f":"IF('bestelbon alg.'!D112=\"\",\"\",IF('bestelbon alg.'!D112=0,\"\",'bestelbon alg.'!D112))","v":""},{"$f":"IF(B144=\"\",\"\",produkten!A87)","v":""},{"$f":"IF(B144=\"\",\"\",produkten!B87)","v":""},{"$f":"'bestelbon alg.'!A112","v":"Rozemarijn - Romarin"},null,null,null,"FOUT"]
[{"$f":"IF(B145=\"\",\"\",VLOOKUP(C145,produkten!$A$1:$C$201,3,FALSE))","v":""},{"$f":"IF('bestelbon alg.'!D113=\"\",\"\",IF('bestelbon alg.'!D113=0,\"\",'bestelbon alg.'!D113))","v":""},{"$f":"IF(B145=\"\",\"\",produkten!A88)","v":""},{"$f":"IF(B145=\"\",\"\",produkten!B88)","v":""},{"$f":"'bestelbon alg.'!A113","v":"Rucola - Roquette"},null,null,null,"FOUT"]
[{"$f":"IF(B146=\"\",\"\",VLOOKUP(C146,produkten!$A$1:$C$201,3,FALSE))","v":""},{"$f":"IF('bestelbon alg.'!D114=\"\",\"\",IF('bestelbon alg.'!D114=0,\"\",'bestelbon alg.'!D114))","v":""},{"$f":"IF(B146=\"\",\"\",produkten!A89)","v":""},{"$f":"IF(B146=\"\",\"\",produkten!B89)","v":""},{"$f":"'bestelbon alg.'!A114","v":"Salanova sla - Laitue Salanova"},null,null,null,"FOUT"]
[{"$f":"IF(B147=\"\",\"\",VLOOKUP(C147,produkten!$A$1:$C$201,3,FALSE))","v":""},{"$f":"IF('bestelbon alg.'!D115=\"\",\"\",IF('bestelbon alg.'!D115=0,\"\",'bestelbon alg.'!D115))","v":""},{"$f":"IF(B147=\"\",\"\",produkten!A90)","v":""},{"$f":"IF(B147=\"\",\"\",produkten!B90)","v":""},{"$f":"'bestelbon alg.'!A115","v":"Salie - Sauge"},null,null,null,"FOUT"]
[{"$f":"IF(B148=\"\",\"\",VLOOKUP(C148,produkten!$A$1:$C$201,3,FALSE))","v":""},{"$f":"IF('bestelbon alg.'!D116=\"\",\"\",IF('bestelbon alg.'!D116=0,\"\",'bestelbon alg.'!D116))","v":""},{"$f":"IF(B148=\"\",\"\",produkten!A91)","v":""},{"$f":"IF(B148=\"\",\"\",produkten!B91)","v":""},{"$f":"'bestelbon alg.'!A116","v":"Salie ananas - Sauge ananas"},null,null,null,"FOUT"]
[{"$f":"IF(B149=\"\",\"\",VLOOKUP(C149,produkten!$A$1:$C$201,3,FALSE))","v":""},{"$f":"IF('bestelbon alg.'!D117=\"\",\"\",IF('bestelbon alg.'!D117=0,\"\",'bestelbon alg.'!D117))","v":""},{"$f":"IF(B149=\"\",\"\",produkten!A92)","v":""},{"$f":"IF(B149=\"\",\"\",produkten!B92)","v":""},{"$f":"'bestelbon alg.'!A117","v":"Snijbiet (Warmoes) - Blette (bette à carde)"},null,null,null,"FOUT"]
[{"$f":"IF(B150=\"\",\"\",VLOOKUP(C150,produkten!$A$1:$C$201,3,FALSE))","v":""},{"$f":"IF('bestelbon alg.'!D118=\"\",\"\",IF('bestelbon alg.'!D118=0,\"\",'bestelbon alg.'!D118))","v":""},{"$f":"IF(B150=\"\",\"\",produkten!A93)","v":""},{"$f":"IF(B150=\"\",\"\",produkten!B93)","v":""},{"$f":"'bestelbon alg.'!A118","v":"Stevia"},null,null,null,"FOUT"]
[{"$f":"IF(B151=\"\",\"\",VLOOKUP(C151,produkten!$A$1:$C$201,3,FALSE))","v":""},{"$f":"IF('bestelbon alg.'!D119=\"\",\"\",IF('bestelbon alg.'!D119=0,\"\",'bestelbon alg.'!D119))","v":""},{"$f":"IF(B151=\"\",\"\",produkten!A94)","v":""},{"$f":"IF(B151=\"\",\"\",produkten!B94)","v":""},{"$f":"'bestelbon alg.'!A119","v":"Tijm - Thym"},null,null,null,"FOUT"]
[{"$f":"IF(B152=\"\",\"\",VLOOKUP(C152,produkten!$A$1:$C$201,3,FALSE))","v":""},{"$f":"IF('bestelbon alg.'!D120=\"\",\"\",IF('bestelbon alg.'!D120=0,\"\",'bestelbon alg.'!D120))","v":""},{"$f":"IF(B152=\"\",\"\",produkten!A95)","v":""},{"$f":"IF(B152=\"\",\"\",produkten!B95)","v":""},{"$f":"'bestelbon alg.'!A120","v":"Tijm Citroen bont - Thym citronelle panaché"},null,null,null,"FOUT"]
[{"$f":"IF(B153=\"\",\"\",VLOOKUP(C153,produkten!$A$1:$C$201,3,FALSE))","v":""},{"$f":"IF('bestelbon alg.'!D121=\"\",\"\",IF('bestelbon alg.'!D121=0,\"\",'bestelbon alg.'!D121))","v":""},{"$f":"IF(B153=\"\",\"\",produkten!A96)","v":""},{"$f":"IF(B153=\"\",\"\",produkten!B96)","v":""},{"$f":"'bestelbon alg.'!A121","v":"Tijm Citroen - Thym citronelle"},null,null,null,"FOUT"]
[{"$f":"IF(B154=\"\",\"\",VLOOKUP(C154,produkten!$A$1:$C$201,3,FALSE))","v":""},{"$f":"IF('bestelbon alg.'!D122=\"\",\"\",IF('bestelbon alg.'!D122=0,\"\",'bestelbon alg.'!D122))","v":""},{"$f":"IF(B154=\"\",\"\",produkten!A97)","v":""},{"$f":"IF(B154=\"\",\"\",produkten!B97)","v":""},{"$f":"'bestelbon alg.'!A122","v":"Valeriaan - Valérian"},null,null,null,"FOUT"]
[{"$f":"IF(B155=\"\",\"\",VLOOKUP(C155,produkten!$A$1:$C$201,3,FALSE))","v":""},{"$f":"IF('bestelbon alg.'!D123=\"\",\"\",IF('bestelbon alg.'!D123=0,\"\",'bestelbon alg.'!D123))","v":""},{"$f":"IF(B155=\"\",\"\",produkten!A98)","v":""},{"$f":"IF(B155=\"\",\"\",produkten!B98)","v":""},{"$f":"'bestelbon alg.'!A123","v":"Wijnruit - Rue  "},null,null,null,{"$f":"IF(E155=C155,\"ok\",\"FOUT\")","v":"FOUT"}]
[{"$f":"IF(B156=\"\",\"\",VLOOKUP(C156,produkten!$A$1:$C$201,3,FALSE))","v":""},{"$f":"IF('bestelbon alg.'!D124=\"\",\"\",IF('bestelbon alg.'!D124=0,\"\",'bestelbon alg.'!D124))","v":""},{"$f":"IF(B156=\"\",\"\",produkten!A99)","v":""},{"$f":"IF(B156=\"\",\"\",produkten!B99)","v":""},{"$f":"'bestelbon alg.'!A124","v":"Laurier - Laurier sauce"},null,null,null,"FOUT"]
[{"$f":"IF(B157=\"\",\"\",VLOOKUP(C157,produkten!$A$1:$C$201,3,FALSE))","v":""},{"$f":"IF('bestelbon alg.'!J78=\"\",\"\",IF('bestelbon alg.'!J78=0,\"\",'bestelbon alg.'!J78))","v":""},{"$f":"IF(B157=\"\",\"\",produkten!A153)","v":""},{"$f":"IF(B157=\"\",\"\",produkten!B153)","v":""},{"$f":"'bestelbon alg.'!F78","v":"Basilicum - Basilic 13 cm"},null,null,null,"FOUT"]
[{"$f":"IF(B158=\"\",\"\",VLOOKUP(C158,produkten!$A$1:$C$201,3,FALSE))","v":""},{"$f":"IF('bestelbon alg.'!J79=\"\",\"\",IF('bestelbon alg.'!J79=0,\"\",'bestelbon alg.'!J79))","v":""},{"$f":"IF(B158=\"\",\"\",produkten!A154)","v":""},{"$f":"IF(B158=\"\",\"\",produkten!B154)","v":""},{"$f":"'bestelbon alg.'!F79","v":"Basilicum rood - Basilic rouge 13 cm"},null,null,null,"FOUT"]
[{"$f":"IF(B159=\"\",\"\",VLOOKUP(C159,produkten!$A$1:$C$201,3,FALSE))","v":""},{"$f":"IF('bestelbon alg.'!J80=\"\",\"\",IF('bestelbon alg.'!J80=0,\"\",'bestelbon alg.'!J80))","v":""},{"$f":"IF(B159=\"\",\"\",produkten!A155)","v":""},{"$f":"IF(B159=\"\",\"\",produkten!B155)","v":""},{"$f":"'bestelbon alg.'!F80","v":"Basilicum Thaise - Basilic Thai 13 cm"},null,null,null,"FOUT"]
[{"$f":"IF(B160=\"\",\"\",VLOOKUP(C160,produkten!$A$1:$C$201,3,FALSE))","v":""},{"$f":"IF('bestelbon alg.'!J81=\"\",\"\",IF('bestelbon alg.'!J81=0,\"\",'bestelbon alg.'!J81))","v":""},{"$f":"IF(B160=\"\",\"\",produkten!A156)","v":""},{"$f":"IF(B160=\"\",\"\",produkten!B156)","v":""},{"$f":"'bestelbon alg.'!F81","v":"Bieslook - Ciboulette 13 cm"},null,null,null,"FOUT"]
[{"$f":"IF(B161=\"\",\"\",VLOOKUP(C161,produkten!$A$1:$C$201,3,FALSE))","v":""},{"$f":"IF('bestelbon alg.'!J82=\"\",\"\",IF('bestelbon alg.'!J82=0,\"\",'bestelbon alg.'!J82))","v":""},{"$f":"IF(B161=\"\",\"\",produkten!A157)","v":""},{"$f":"IF(B161=\"\",\"\",produkten!B157)","v":""},{"$f":"'bestelbon alg.'!F82","v":"Citroenverbena - Verveine Citronelle 13 cm"},null,null,null,"FOUT"]
[{"$f":"IF(B162=\"\",\"\",VLOOKUP(C162,produkten!$A$1:$C$201,3,FALSE))","v":""},{"$f":"IF('bestelbon alg.'!J83=\"\",\"\",IF('bestelbon alg.'!J83=0,\"\",'bestelbon alg.'!J83))","v":""},{"$f":"IF(B162=\"\",\"\",produkten!A158)","v":""},{"$f":"IF(B162=\"\",\"\",produkten!B158)","v":""},{"$f":"'bestelbon alg.'!F83","v":"Dragon - Estragon 13 cm"},null,null,null,"FOUT"]
[{"$f":"IF(B163=\"\",\"\",VLOOKUP(C163,produkten!$A$1:$C$201,3,FALSE))","v":""},{"$f":"IF('bestelbon alg.'!J84=\"\",\"\",IF('bestelbon alg.'!J84=0,\"\",'bestelbon alg.'!J84))","v":""},{"$f":"IF(B163=\"\",\"\",produkten!A159)","v":""},{"$f":"IF(B163=\"\",\"\",produkten!B159)","v":""},{"$f":"'bestelbon alg.'!F84","v":"Koriander - Coriandre 13 cm"},null,null,null,"FOUT"]
[{"$f":"IF(B164=\"\",\"\",VLOOKUP(C164,produkten!$A$1:$C$201,3,FALSE))","v":""},{"$f":"IF('bestelbon alg.'!J85=\"\",\"\",IF('bestelbon alg.'!J85=0,\"\",'bestelbon alg.'!J85))","v":""},{"$f":"IF(B164=\"\",\"\",produkten!A160)","v":""},{"$f":"IF(B164=\"\",\"\",produkten!B160)","v":""},{"$f":"'bestelbon alg.'!F85","v":"Marokkaanse Munt - Menthe Marocaine 13 cm"},null,null,null,"FOUT"]
[{"$f":"IF(B165=\"\",\"\",VLOOKUP(C165,produkten!$A$1:$C$201,3,FALSE))","v":""},{"$f":"IF('bestelbon alg.'!J86=\"\",\"\",IF('bestelbon alg.'!J86=0,\"\",'bestelbon alg.'!J86))","v":""},{"$f":"IF(B165=\"\",\"\",produkten!A161)","v":""},{"$f":"IF(B165=\"\",\"\",produkten!B161)","v":""},{"$f":"'bestelbon alg.'!F86","v":"Oregano - Origan 13 cm"},null,null,null,"FOUT"]
[{"$f":"IF(B166=\"\",\"\",VLOOKUP(C166,produkten!$A$1:$C$201,3,FALSE))","v":""},{"$f":"IF('bestelbon alg.'!J87=\"\",\"\",IF('bestelbon alg.'!J87=0,\"\",'bestelbon alg.'!J87))","v":""},{"$f":"IF(B166=\"\",\"\",produkten!A162)","v":""},{"$f":"IF(B166=\"\",\"\",produkten!B162)","v":""},{"$f":"'bestelbon alg.'!F87","v":"Peterselie - Persil 13 cm"},null,null,null,"FOUT"]
[{"$f":"IF(B167=\"\",\"\",VLOOKUP(C167,produkten!$A$1:$C$201,3,FALSE))","v":""},{"$f":"IF('bestelbon alg.'!J88=\"\",\"\",IF('bestelbon alg.'!J88=0,\"\",'bestelbon alg.'!J88))","v":""},{"$f":"IF(B167=\"\",\"\",produkten!A163)","v":""},{"$f":"IF(B167=\"\",\"\",produkten!B163)","v":""},{"$f":"'bestelbon alg.'!F88","v":"Bladpeterselie - Persil plat 13 cm"},null,null,null,{"$f":"IF(E167=C167,\"ok\",\"FOUT\")","v":"FOUT"}]
[{"$f":"IF(B168=\"\",\"\",VLOOKUP(C168,produkten!$A$1:$C$201,3,FALSE))","v":""},{"$f":"IF('bestelbon alg.'!J89=\"\",\"\",IF('bestelbon alg.'!J89=0,\"\",'bestelbon alg.'!J89))","v":""},{"$f":"IF(B168=\"\",\"\",produkten!A164)","v":""},{"$f":"IF(B168=\"\",\"\",produkten!B164)","v":""},{"$f":"'bestelbon alg.'!F89","v":"Pluksla - Laitue à couper 13 cm"},null,null,null,"FOUT"]
[{"$f":"IF(B169=\"\",\"\",VLOOKUP(C169,produkten!$A$1:$C$201,3,FALSE))","v":""},{"$f":"IF('bestelbon alg.'!J90=\"\",\"\",IF('bestelbon alg.'!J90=0,\"\",'bestelbon alg.'!J90))","v":""},{"$f":"IF(B169=\"\",\"\",produkten!A165)","v":""},{"$f":"IF(B169=\"\",\"\",produkten!B165)","v":""},{"$f":"'bestelbon alg.'!F90","v":"Rozemarijn - Romarin 13 cm"},null,null,null,"FOUT"]
[{"$f":"IF(B170=\"\",\"\",VLOOKUP(C170,produkten!$A$1:$C$201,3,FALSE))","v":""},{"$f":"IF('bestelbon alg.'!J91=\"\",\"\",IF('bestelbon alg.'!J91=0,\"\",'bestelbon alg.'!J91))","v":""},{"$f":"IF(B170=\"\",\"\",produkten!A166)","v":""},{"$f":"IF(B170=\"\",\"\",produkten!B166)","v":""},{"$f":"'bestelbon alg.'!F91","v":"Rucola - Roquette 13 cm"},null,null,null,"FOUT"]
[{"$f":"IF(B171=\"\",\"\",VLOOKUP(C171,produkten!$A$1:$C$201,3,FALSE))","v":""},{"$f":"IF('bestelbon alg.'!J92=\"\",\"\",IF('bestelbon alg.'!J92=0,\"\",'bestelbon alg.'!J92))","v":""},{"$f":"IF(B171=\"\",\"\",produkten!A167)","v":""},{"$f":"IF(B171=\"\",\"\",produkten!B167)","v":""},{"$f":"'bestelbon alg.'!F92","v":"Salie - Sauge 13 cm"},null,null,null,"FOUT"]
[{"$f":"IF(B172=\"\",\"\",VLOOKUP(C172,produkten!$A$1:$C$201,3,FALSE))","v":""},{"$f":"IF('bestelbon alg.'!J93=\"\",\"\",IF('bestelbon alg.'!J93=0,\"\",'bestelbon alg.'!J93))","v":""},{"$f":"IF(B172=\"\",\"\",produkten!A168)","v":""},{"$f":"IF(B172=\"\",\"\",produkten!B168)","v":""},{"$f":"'bestelbon alg.'!F93","v":"Tijm - Thym 13 cm"},null,null,null,"FOUT"]
[{"$f":"IF(B173=\"\",\"\",VLOOKUP(C173,produkten!$A$1:$C$201,3,FALSE))","v":""},{"$f":"IF('bestelbon alg.'!J94=\"\",\"\",IF('bestelbon alg.'!J94=0,\"\",'bestelbon alg.'!J94))","v":""},{"$f":"IF(B173=\"\",\"\",produkten!A169)","v":""},{"$f":"IF(B173=\"\",\"\",produkten!B169)","v":""},{"$f":"'bestelbon alg.'!F94","v":"Tijm citroen - Thym citron 13 cm"},null,null,null,"FOUT"]
[{"$f":"IF(B174=\"\",\"\",VLOOKUP(C174,produkten!$A$1:$C$201,3,FALSE))","v":""},{"$f":"IF('bestelbon alg.'!J96=\"\",\"\",IF('bestelbon alg.'!J96=0,\"\",'bestelbon alg.'!J96))","v":""},{"$f":"IF(B174=\"\",\"\",produkten!A171)","v":""},{"$f":"IF(B174=\"\",\"\",produkten!B171)","v":""},{"$f":"'bestelbon alg.'!F96","v":"Prei - Poireau 13cm"},null,null,null,"FOUT"]
[{"$f":"IF(B175=\"\",\"\",VLOOKUP(C175,produkten!$A$1:$C$201,3,FALSE))","v":""},{"$f":"IF('bestelbon alg.'!J97=\"\",\"\",IF('bestelbon alg.'!J97=0,\"\",'bestelbon alg.'!J97))","v":""},{"$f":"IF(B175=\"\",\"\",produkten!A172)","v":""},{"$f":"IF(B175=\"\",\"\",produkten!B172)","v":""},{"$f":"'bestelbon alg.'!F97","v":"Rabarber - Rhubarbe 13cm"},null,null,null,"FOUT"]
[{"$f":"IF(B176=\"\",\"\",VLOOKUP(C176,produkten!$A$1:$C$201,3,FALSE))","v":""},{"$f":"IF('bestelbon alg.'!J98=\"\",\"\",IF('bestelbon alg.'!J98=0,\"\",'bestelbon alg.'!J98))","v":""},{"$f":"IF(B176=\"\",\"\",produkten!A173)","v":""},{"$f":"IF(B176=\"\",\"\",produkten!B173)","v":""},{"$f":"'bestelbon alg.'!F98","v":"Zoete aardappel - Patate douce 13 cm"},null,null,null,"FOUT"]
[{"$f":"IF(B177=\"\",\"\",VLOOKUP(C177,produkten!$A$1:$C$201,3,FALSE))","v":""},{"$f":"IF('bestelbon alg.'!J101=\"\",\"\",IF('bestelbon alg.'!J101=0,\"\",'bestelbon alg.'!J101))","v":""},{"$f":"IF(B177=\"\",\"\",produkten!A174)","v":""},{"$f":"IF(B177=\"\",\"\",produkten!B174)","v":""},{"$f":"'bestelbon alg.'!F101","v":"Basilicum - Basilic 24 cm"},null,null,null,"FOUT"]
[{"$f":"IF(B178=\"\",\"\",VLOOKUP(C178,produkten!$A$1:$C$201,3,FALSE))","v":""},{"$f":"IF('bestelbon alg.'!J102=\"\",\"\",IF('bestelbon alg.'!J102=0,\"\",'bestelbon alg.'!J102))","v":""},{"$f":"IF(B178=\"\",\"\",produkten!A175)","v":""},{"$f":"IF(B178=\"\",\"\",produkten!B175)","v":""},{"$f":"'bestelbon alg.'!F102","v":"Munt - Menthe 24 cm"},null,null,null,"FOUT"]
[{"$f":"IF(B179=\"\",\"\",VLOOKUP(C179,produkten!$A$1:$C$201,3,FALSE))","v":""},{"$f":"IF('bestelbon alg.'!J103=\"\",\"\",IF('bestelbon alg.'!J103=0,\"\",'bestelbon alg.'!J103))","v":""},{"$f":"IF(B179=\"\",\"\",produkten!A176)","v":""},{"$f":"IF(B179=\"\",\"\",produkten!B176)","v":""},{"$f":"'bestelbon alg.'!F103","v":"Rozemarijn - Romarin 24 cm"},null,null,null,{"$f":"IF(E179=C179,\"ok\",\"FOUT\")","v":"FOUT"}]
[{"$f":"IF(B180=\"\",\"\",VLOOKUP(C180,produkten!$A$1:$C$201,3,FALSE))","v":""},{"$f":"IF('bestelbon alg.'!J104=\"\",\"\",IF('bestelbon alg.'!J104=0,\"\",'bestelbon alg.'!J104))","v":""},{"$f":"IF(B180=\"\",\"\",produkten!A177)","v":""},{"$f":"IF(B180=\"\",\"\",produkten!B177)","v":""},{"$f":"'bestelbon alg.'!F104","v":"Tijm - Thym 24 cm"},null,null,null,{"$f":"IF(E180=C180,\"ok\",\"FOUT\")","v":"FOUT"}]
[{"$f":"IF(B181=\"\",\"\",VLOOKUP(C181,produkten!$A$1:$C$201,3,FALSE))","v":""},{"$f":"IF('bestelbon alg.'!J105=\"\",\"\",IF('bestelbon alg.'!J105=0,\"\",'bestelbon alg.'!J105))","v":""},{"$f":"IF(B181=\"\",\"\",produkten!A178)","v":""},{"$f":"IF(B181=\"\",\"\",produkten!B178)","v":""},{"$f":"'bestelbon alg.'!F105","v":"BBQ mix 24 cm"},null,null,null,"FOUT"]
[{"$f":"IF(B182=\"\",\"\",VLOOKUP(C182,produkten!$A$1:$C$201,3,FALSE))","v":""},{"$f":"IF('bestelbon alg.'!J106=\"\",\"\",IF('bestelbon alg.'!J106=0,\"\",'bestelbon alg.'!J106))","v":""},{"$f":"IF(B182=\"\",\"\",produkten!A179)","v":""},{"$f":"IF(B182=\"\",\"\",produkten!B179)","v":""},{"$f":"'bestelbon alg.'!F106","v":"Pizza-Pasta mix 24 cm"},null,null,null,"FOUT"]
[{"$f":"IF(B183=\"\",\"\",VLOOKUP(C183,produkten!$A$1:$C$201,3,FALSE))","v":""},{"$f":"IF('bestelbon alg.'!J107=\"\",\"\",IF('bestelbon alg.'!J107=0,\"\",'bestelbon alg.'!J107))","v":""},{"$f":"IF(B183=\"\",\"\",produkten!A180)","v":""},{"$f":"IF(B183=\"\",\"\",produkten!B180)","v":""},{"$f":"'bestelbon alg.'!F107","v":"Provence mix 24cm"},null,null,null,"FOUT"]
[{"$f":"IF(B184=\"\",\"\",VLOOKUP(C184,produkten!$A$1:$C$201,3,FALSE))","v":""},{"$f":"IF('bestelbon alg.'!J110=\"\",\"\",IF('bestelbon alg.'!J110=0,\"\",'bestelbon alg.'!J110))","v":""},{"$f":"IF(B184=\"\",\"\",produkten!A181)","v":""},{"$f":"IF(B184=\"\",\"\",produkten!B181)","v":""},{"$f":"'bestelbon alg.'!F110","v":"Hangpot doordrager - Suspension remontant"},null,null,null,"FOUT"]
[{"$f":"IF(B185=\"\",\"\",VLOOKUP(C185,produkten!$A$1:$C$201,3,FALSE))","v":""},{"$f":"IF('bestelbon alg.'!J111=\"\",\"\",IF('bestelbon alg.'!J111=0,\"\",'bestelbon alg.'!J111))","v":""},{"$f":"IF(B185=\"\",\"\",produkten!A182)","v":""},{"$f":"IF(B185=\"\",\"\",produkten!B182)","v":""},{"$f":"'bestelbon alg.'!F111","v":"Hangpot Patio Pink - Suspension Patio pink"},null,null,null,"FOUT"]
[{"$f":"IF(B186=\"\",\"\",VLOOKUP(C186,produkten!$A$1:$C$201,3,FALSE))","v":""},{"$f":"IF('bestelbon alg.'!J113=\"\",\"\",IF('bestelbon alg.'!J113=0,\"\",'bestelbon alg.'!J113))","v":""},{"$f":"IF(B186=\"\",\"\",produkten!A183)","v":""},{"$f":"IF(B186=\"\",\"\",produkten!B183)","v":""},{"$f":"'bestelbon alg.'!F113","v":"Ostara lente - printemps"},null,null,null,"FOUT"]
[{"$f":"IF(B187=\"\",\"\",VLOOKUP(C187,produkten!$A$1:$C$201,3,FALSE))","v":""},{"$f":"IF('bestelbon alg.'!J114=\"\",\"\",IF('bestelbon alg.'!J114=0,\"\",'bestelbon alg.'!J114))","v":""},{"$f":"IF(B187=\"\",\"\",produkten!A184)","v":""},{"$f":"IF(B187=\"\",\"\",produkten!B184)","v":""},{"$f":"'bestelbon alg.'!F114","v":"Mara de bois lente - printemps"},null,null,null,"FOUT"]
[{"$f":"IF(B188=\"\",\"\",VLOOKUP(C188,produkten!$A$1:$C$201,3,FALSE))","v":""},{"$f":"IF('bestelbon alg.'!J115=\"\",\"\",IF('bestelbon alg.'!J115=0,\"\",'bestelbon alg.'!J115))","v":""},{"$f":"IF(B188=\"\",\"\",produkten!A185)","v":""},{"$f":"IF(B188=\"\",\"\",produkten!B185)","v":""},{"$f":"'bestelbon alg.'!F115","v":"Darselect lente - printemps"},null,null,null,"FOUT"]
[{"$f":"IF(B189=\"\",\"\",VLOOKUP(C189,produkten!$A$1:$C$201,3,FALSE))","v":""},{"$f":"IF('bestelbon alg.'!J116=\"\",\"\",IF('bestelbon alg.'!J116=0,\"\",'bestelbon alg.'!J116))","v":""},{"$f":"IF(B189=\"\",\"\",produkten!A186)","v":""},{"$f":"IF(B189=\"\",\"\",produkten!B186)","v":""},{"$f":"'bestelbon alg.'!F116","v":"Elsanta lente - printemps"},null,null,null,"FOUT"]
[{"$f":"IF(B190=\"\",\"\",VLOOKUP(C190,produkten!$A$1:$C$201,3,FALSE))","v":""},{"$f":"IF('bestelbon alg.'!J117=\"\",\"\",IF('bestelbon alg.'!J117=0,\"\",'bestelbon alg.'!J117))","v":""},{"$f":"IF(B190=\"\",\"\",produkten!A187)","v":""},{"$f":"IF(B190=\"\",\"\",produkten!B187)","v":""},{"$f":"'bestelbon alg.'!F117","v":"Gariguette lente - printemps"},null,null,null,"FOUT"]
[{"$f":"IF(B191=\"\",\"\",VLOOKUP(C191,produkten!$A$1:$C$201,3,FALSE))","v":""},{"$f":"IF('bestelbon alg.'!J118=\"\",\"\",IF('bestelbon alg.'!J118=0,\"\",'bestelbon alg.'!J118))","v":""},{"$f":"IF(B191=\"\",\"\",produkten!A188)","v":""},{"$f":"IF(B191=\"\",\"\",produkten!B188)","v":""},{"$f":"'bestelbon alg.'!F118","v":"Korona lente - printemps"},null,null,null,"FOUT"]
[{"$f":"IF(B192=\"\",\"\",VLOOKUP(C192,produkten!$A$1:$C$201,3,FALSE))","v":""},{"$f":"IF('bestelbon alg.'!J119=\"\",\"\",IF('bestelbon alg.'!J119=0,\"\",'bestelbon alg.'!J119))","v":""},{"$f":"IF(B192=\"\",\"\",produkten!A189)","v":""},{"$f":"IF(B192=\"\",\"\",produkten!B189)","v":""},{"$f":"'bestelbon alg.'!F119","v":"Lambada lente - printemps"},null,null,null,"FOUT"]
[{"$f":"IF(B193=\"\",\"\",VLOOKUP(C193,produkten!$A$1:$C$201,3,FALSE))","v":""},{"$f":"IF('bestelbon alg.'!J120=\"\",\"\",IF('bestelbon alg.'!J120=0,\"\",'bestelbon alg.'!J120))","v":""},{"$f":"IF(B193=\"\",\"\",produkten!A190)","v":""},{"$f":"IF(B193=\"\",\"\",produkten!B190)","v":""},{"$f":"'bestelbon alg.'!F120","v":"Senga Sengana lente - printemps"},null,null,null,"FOUT"]
[{"$f":"IF(B194=\"\",\"\",VLOOKUP(C194,produkten!$A$1:$C$201,3,FALSE))","v":""},{"$f":"IF('bestelbon alg.'!J122=\"\",\"\",IF('bestelbon alg.'!J122=0,\"\",'bestelbon alg.'!J122))","v":""},{"$f":"IF(B194=\"\",\"\",produkten!A191)","v":""},{"$f":"IF(B194=\"\",\"\",produkten!B192)","v":""},{"$f":"'bestelbon alg.'!F122","v":"Ostara zomer - été"},null,null,null,"FOUT"]
[{"$f":"IF(B195=\"\",\"\",VLOOKUP(C195,produkten!$A$1:$C$201,3,FALSE))","v":""},{"$f":"IF('bestelbon alg.'!J123=\"\",\"\",IF('bestelbon alg.'!J123=0,\"\",'bestelbon alg.'!J123))","v":""},{"$f":"IF(B195=\"\",\"\",produkten!A192)","v":""},{"$f":"IF(B195=\"\",\"\",produkten!B193)","v":""},{"$f":"'bestelbon alg.'!F123","v":"Darselect zomer - été"},null,null,null,"FOUT"]
[{"$f":"IF(B196=\"\",\"\",VLOOKUP(C196,produkten!$A$1:$C$201,3,FALSE))","v":""},{"$f":"IF('bestelbon alg.'!J124=\"\",\"\",IF('bestelbon alg.'!J124=0,\"\",'bestelbon alg.'!J124))","v":""},{"$f":"IF(B196=\"\",\"\",produkten!A193)","v":""},{"$f":"IF(B196=\"\",\"\",produkten!B194)","v":""},{"$f":"'bestelbon alg.'!F124","v":"Elsanta zomer - été"},null,null,null,"FOUT"]
[{"$f":"IF(B197=\"\",\"\",VLOOKUP(C197,produkten!$A$1:$C$201,3,FALSE))","v":""},{"$f":"IF('bestelbon alg.'!J125=\"\",\"\",IF('bestelbon alg.'!J125=0,\"\",'bestelbon alg.'!J125))","v":""},{"$f":"IF(B197=\"\",\"\",produkten!A194)","v":""},{"$f":"IF(B197=\"\",\"\",produkten!B195)","v":""},{"$f":"'bestelbon alg.'!F125","v":"Gariguette zomer - été"},null,null,null,"FOUT"]
[{"$f":"IF(B198=\"\",\"\",VLOOKUP(C198,produkten!$A$1:$C$201,3,FALSE))","v":""},{"$f":"IF('bestelbon alg.'!J126=\"\",\"\",IF('bestelbon alg.'!J126=0,\"\",'bestelbon alg.'!J126))","v":""},{"$f":"IF(B198=\"\",\"\",produkten!A195)","v":""},{"$f":"IF(B198=\"\",\"\",produkten!B196)","v":""},{"$f":"'bestelbon alg.'!F126","v":"Vima Xima zomer - été"},null,null,null,"FOUT"]
[{"$f":"IF(B199=\"\",\"\",VLOOKUP(C199,produkten!$A$1:$C$201,3,FALSE))","v":""},{"$f":"IF('bestelbon alg.'!J128=\"\",\"\",IF('bestelbon alg.'!J128=0,\"\",'bestelbon alg.'!J128))","v":""},{"$f":"IF(B199=\"\",\"\",produkten!A196)","v":""},{"$f":"IF(B199=\"\",\"\",produkten!B196)","v":""},{"$f":"'bestelbon alg.'!F128","v":"Ostara 13 cm "},null,null,null,"FOUT"]
[{"$f":"IF(B200=\"\",\"\",VLOOKUP(C200,produkten!$A$1:$C$201,3,FALSE))","v":""},{"$f":"IF('bestelbon alg.'!J129=\"\",\"\",IF('bestelbon alg.'!J129=0,\"\",'bestelbon alg.'!J129))","v":""},{"$f":"IF(B200=\"\",\"\",produkten!A197)","v":""},{"$f":"IF(B200=\"\",\"\",produkten!B197)","v":""},{"$f":"'bestelbon alg.'!F129","v":"Elsanta 13 cm "},null,null,null,"FOUT"]
[{"$f":"IF(B201=\"\",\"\",VLOOKUP(C201,produkten!$A$1:$C$201,3,FALSE))","v":""},{"$f":"IF('bestelbon alg.'!J130=\"\",\"\",IF('bestelbon alg.'!J130=0,\"\",'bestelbon alg.'!J130))","v":""},{"$f":"IF(B201=\"\",\"\",produkten!A198)","v":""},{"$f":"IF(B201=\"\",\"\",produkten!B198)","v":""},{"$f":"'bestelbon alg.'!F130","v":"Bosaardbei - Fraisier des bois 13 cm"},null,null,null,"FOUT"]
[{"$f":"IF(B202=\"\",\"\",VLOOKUP(C202,produkten!$A$1:$C$201,3,FALSE))","v":""},{"$f":"IF('bestelbon alg.'!J131=\"\",\"\",IF('bestelbon alg.'!J131=0,\"\",'bestelbon alg.'!J131))","v":""},{"$f":"IF(B202=\"\",\"\",produkten!A199)","v":""},{"$f":"IF(B202=\"\",\"\",produkten!B199)","v":""},{"$f":"'bestelbon alg.'!F131","v":"Patio Pink 13 cm"},null,null,null,"FOUT"]
[{"$f":"IF(B203=\"\",\"\",VLOOKUP(C203,produkten!$A$1:$C$201,3,FALSE))","v":""},{"$f":"IF('bestelbon alg.'!J132=\"\",\"\",IF('bestelbon alg.'!J132=0,\"\",'bestelbon alg.'!J132))","v":""},{"$f":"IF(B203=\"\",\"\",produkten!A200)","v":""},{"$f":"IF(B203=\"\",\"\",produkten!B200)","v":""},{"$f":"'bestelbon alg.'!F132","v":"Framboo 13 cm "},null,null,null,"FOUT"]
[{"$f":"IF(B204=\"\",\"\",VLOOKUP(C204,produkten!$A$1:$C$201,3,FALSE))","v":""},{"$f":"IF('bestelbon alg.'!J133=\"\",\"\",IF('bestelbon alg.'!J133=0,\"\",'bestelbon alg.'!J133))","v":""},{"$f":"IF(B204=\"\",\"\",produkten!A201)","v":""},{"$f":"IF(B204=\"\",\"\",produkten!B201)","v":""},{"$f":"'bestelbon alg.'!F133","v":"Snow white 13cm"},null,null,null,"FOUT"]
[]
[null,null,null,null,{"$f":"SUM(B5:B203)","v":0},{"$f":"TEXT(E206,0)","v":"0"}]

{"sheet":"finaal","index":2,"n_rows":4,"n_cols":6,"rows_kept":4,"cut":false,"hidden":false,"merged":[]}
[null,{"$f":"'bon 1 met nr'!A1","v":"NAAM :"},{"$f":"'bon 1 met nr'!B1","v":""},{"$f":"CONCATENATE(SUBSTITUTE(C1,\" \",\"\"),IF(B2=\"\",TEXT(C3,\"dd-mm-jj\"),TEXT(B2,\"dd-mm-jj\")))","v":""}]
[{"$f":"'bon 1 met nr'!A2","v":"Afhaling : "},{"$f":"'bon 1 met nr'!B2","v":""},{"$f":"'bon 1 met nr'!C2","v":""},{"$f":"C2","v":""}]
[null,{"$f":"'bon 1 met nr'!B3","v":"Datum levering :"},{"$f":"'bon 1 met nr'!C3","v":""}]
[null,{"$f":"'bon 1 met nr'!A4","v":"uur : "},{"$f":"'bon 1 met nr'!B4","v":""},{"$f":"'bon 1 met nr'!C4","v":"#colli : 0"},"# rijen :",{"$f":"COUNTIF(B5:B300,\">0\")","v":0}]

{"sheet":"produkten","index":3,"n_rows":201,"n_cols":3,"rows_kept":201,"cut":false,"hidden":true,"merged":[]}
["Komkommer  -  Concombre","10 cm","AL0020"]
["Snack Komkommer- Concombre snack","10 cm","AL0030"]
["Paprika rood  -  Poivron rouge","10 cm","AL0040"]
["Paprika geel  -  Poivron jaune","10 cm","AL0050"]
["Zoete Punt Paprika - Poivron doux allongé","10 cm","AL0060"]
["Aubergine ","10 cm","AL0070"]
["Spaanse peper  -  Piment","10 cm","AL0080"]
["Potpeper  -  Piment Patio","10 cm","AL0085"]
["Vleestomaat - Tomate Charnue Hybride F1","10 cm","AL0090"]
["Cherrytomaat - Tomate apéritif F1","10 cm","AL0100"]
["Pot tomaat - Tomate Patio","10 cm","AL0110"]
["Trostomaat  -  Tomate grapes F1","10 cm","AL0120"]
["Italiaanse tomaat - Tomate Roma F1","10 cm","AL0130"]
["Tomaat - Tomate 'Cœur de Bœuf'","10 cm","AL0140"]
["Snoep tomaat - Tomate Snack F1","10 cm","AL0150"]
["Gele tomaat - Tomate jaune F1","10 cm","AL0160"]
["Tomaat - Tomate 'Marmande'","10 cm-doosje","AL0170"]
["Tomaat - Tomate 'Pyros' F1","10 cm-doosje","AL0180"]
["Tomaat - Tomate 'Saint-Pierre'","10 cm-doosje","AL0190"]
["Tomaat - Tomate 'Green Zebra'","10 cm-doosje","AL0191"]
["Tomaat - Tomate 'Noir de Crimée'","10 cm-doosje","AL0192"]
["Tomaat - Tomate 'Andine Cornue'","10 cm-doosje","AL0193"]
["Tomaat - Tomate 'Yellow Pear'","10 cm-doosje","AL0195"]
["Tomaat - Tomate 'Costoluto Genovese'","10 cm-doosje","AL0196"]
["Meloen - Melon 'Charentais'","10 cm-doosje","AL0200"]
["Honingmeloen - Melon miel","10 cm-doosje","AL0205"]
[{"$f":"[1]bestelbon!$A38","v":"Watermeloen - Pastèque"},"11 cm-doosje","AL0210"]
["Patisson","10 cm-doosje","AL0220"]
["Courgette Groen - Vert","10 cm-doosje","AL0230"]
["Courgette Geel - jaune","10 cm-doosje","AL0240"]
["Courgette Rond - Ronde","10 cm-doosje","AL0250"]
["Pompoen - Potiron ' Gele reus'","10 cm-doosje","AL0260"]
["Potimarron","10 cm-doosje","AL0270"]
["Butternut pompoen - Citrouille Butternut","10 cm-doosje","AL0272"]
["Pompoen - Potiron 'Rouge Vif d'Etampes'","10 cm-doosje","AL0274"]
["Spaghettipompoen - Courge Spaghetti","10 cm-doosje","AL0276"]
["Augurk - Cornichon","10 cm-doosje","AL0280"]
["Struikboon-Haricot Nain","10 cm-doosje","AL0290"]
["Boterboon - Haricot Nain Beurre","10 cm-doosje","AL0293"]
["Staaksnijboon-Haricot à rames","10 cm-doosje","AL0294"]
["Erwt - Petits pois","10 cm-doosje","AL0297"]
["Suikermais - maïs Sucré","10 cm-doosje","AL0299"]
["G/ Komkommer  -  Concombre","10 cm-doosje","AL0310"]
["G/ Snack Komkommer- Concombre snack","10 cm-doosje","AL0330"]
["G/ Aubergine","10 cm-doosje","AL0360"]
["G/ Vleestomaat - Tomate charnue F1","10 cm-doosje","AL0380"]
["G/ Cherrytomaat - Tomate apéritif F1","10 cm-doosje","AL0390"]
["G/ Trostomaat  -  Tomate grapes F1","10 cm-doosje","AL0400"]
["G/ Italiaanse tomaat - Tomate Roma F1","10 cm-doosje","AL0410"]
["G/ Tomaat - Tomate 'Cœur de Bœuf'","10 cm-doosje","AL0420"]
["G/ Snoep tomaat - Tomate Snack F1","10 cm-doosje","AL0430"]
["G/ Meloen - Melon 'Charentais'","10 cm-doosje","AL0450"]
["G/ Tom. geënt getopt - Tom. double tête","10 cm-doosje","AL0480"]
["Aztekenkruid (Honingverbena) - L'herbe sucrée des Aztéques","Ø 10,5 cm","AL1510"]
["Basilicum - Basilic","Ø 10,5 cm","AL1520"]
["Basilicum Citroen - Basilic Citron","Ø 10,5 cm","AL1530"]
["Basilicum Rood - Basilic Rouge","Ø 10,5 cm","AL1540"]
["Basilicum struik - Basilic Fine vert","Ø 10,5 cm","AL1550"]
["Basilicum Thaise - Basilic Thai","Ø 10,5 cm","AL1560"]
["Bieslook - Ciboulette","Ø 10,5 cm","AL1570"]
["Chinese bieslook - Ciboule de Chine","Ø 10,5 cm","AL1580"]
["Bloedzuring - Oseille Sanguine","Ø 10,5 cm","AL1590"]
["Bonenkruid - Sariette","Ø 10,5 cm","AL1600"]
["Citroengras - Citronelle de l'Inde","Ø 10,5 cm","AL1610"]
["Citroenmelisse - Mélisse de citron","Ø 10,5 cm","AL1620"]
["Citroenverbena - Verveine Citronelle","Ø 10,5 cm","AL1630"]
["Colakruid - Cola-végétal","Ø 10,5 cm","AL1640"]
["Kerrieplant - Plante à Curry","Ø 10,5 cm","AL1650"]
["Dille - Aneth","Ø 10,5 cm","AL1660"]
["Dragon - Estragon","Ø 10,5 cm","AL1670"]
["Kamille - Camomille","Ø 10,5 cm","AL1680"]
["Kervel - Cerfeuil","Ø 10,5 cm","AL1690"]
["Koriander - Coriandre","Ø 10,5 cm","AL1700"]
["Lavas - Livêche","Ø 10,5 cm","AL1710"]
["Marjolein - Marjoleine","Ø 10,5 cm","AL1720"]
["Munt 'Aardbei' - Menthe 'fraise'","Ø 10,5 cm","AL1730"]
["Munt 'Appel'- Menthe 'Pomme'","Ø 10,5 cm","AL1740"]
["Marokkaanse Munt - Menthe Marocaine","Ø 10,5 cm","AL1750"]
["Pepermunt - Menthe Poivrée","Ø 10,5 cm","AL1760"]
["Olijfkruid - santolina","Ø 10,5 cm","AL1770"]
["Oregano - Origan","Ø 10,5 cm","AL1780"]
["Pastinaak - Panais","Ø 10,5 cm","AL1790"]
["Peterselie - Persil","Ø 10,5 cm","AL1800"]
["Bladpeterselie - Persil Plat","Ø 10,5 cm","AL1810"]
["Pluksla - Laitue à couper","Ø 10,5 cm","AL1820"]
["Radijs - Radis","Ø 10,5 cm","AL1830"]
["Rozemarijn - Romarin","Ø 10,5 cm","AL1840"]
["Rucola - Roquette","Ø 10,5 cm","AL1850"]
["Salanova sla - Laitue Salanova","Ø 10,5 cm","AL1860"]
["Salie - Sauge","Ø 10,5 cm","AL1890"]
["Salie ananas - Sauge ananas","Ø 10,5 cm","AL1900"]
["Snijbiet (Warmoes) - Blette (bette à carde)","Ø 10,5 cm","AL1905"]
["Stevia","Ø 10,5 cm","AL1910"]
["Tijm - Thym","Ø 10,5 cm","AL1920"]
["Tijm Citroen bont - Thym citronelle panaché","Ø 10,5 cm","AL1930"]
["Tijm Citroen - Thym citronelle","Ø 10,5 cm","AL1940"]
["Valeriaan - Valérian","Ø 10,5 cm","AL1950"]
["Wijnruit - Rue  ","Ø 10,5 cm","AL1960"]
["Laurier - Laurier sauce","Ø 10,5 cm","AL1970"]
["Witte Selder  -  Céleri blanc","4 cm","AL0610"]
["Groene Selder  -  Céleri vert","4 cm","AL0620"]
["Knolselder  -  Céleri rave","4 cm","AL0630"]
["Venkel  -  Fenouil","4 cm","AL0640"]
["Peterselie  -  Persil","4 cm","AL0650"]
[{"$f":"[1]bestelbon!$F17","v":"Bladpeterselie - Persil 'Plat'"},"4 cm","AL0660"]
["Snijselder  -  Céleri à jets","4 cm","AL0670"]
["Suikerbrood  -  Pain de sucre","4 cm","AL0680"]
["Radicchio","4 cm","AL0690"]
["Chinese kool - Chou Chinois","4 cm","AL0700"]
["Paksoi","4 cm","AL0705"]
["Rode Biet - Betterave rouge","4 cm","AL0710"]
["Koolrabi - Chou Rave","4 cm","AL0720"]
["Lente-Ui  -  Oignons Blancs","4 cm","AL0730"]
["Rode Ui - Oignons Rouges","4 cm","AL0740"]
[{"$f":"[1]bestelbon!$F27","v":"Bloemkool - Chou fleur F1"},"4 cm","AL0750"]
[{"$f":"[1]bestelbon!$F28","v":"Spruitkool - Chou de Bruxelles F1"},"4 cm","AL0760"]
["Savooikool - Chou Milan F1","4 cm","AL0770"]
["Rode kool - Chou rouge F1","4 cm","AL0780"]
["Witte kool - Chou blanc F1","4 cm","AL0790"]
["Spitskool - Chou pointu F1","4 cm","AL0800"]
["Broccoli - Chou Brocoli F1","4 cm","AL0810"]
["Boerenkool - Chou frisé F1","4 cm","AL0820"]
["Torentjesbloemkool - Chou Romanesco","4 cm","AL0825"]
["Andijvie  -  Scarole","4 cm","AL0830"]
["Krulandijvie - Fine maraîchère","4 cm","AL0840"]
["Kropsla  -  Laitue","4 cm","AL0850"]
["Serresla - Laitue de serre","4 cm","AL0860"]
["Sla - 5 cm (serre)","4 cm","AL0870"]
["Sla - Laitue 'Lollo Rossa'","4 cm","AL0880"]
["Sla - Laitue 'Lollo Verto'","4 cm","AL0890"]
["4-seizoenen sla  -  Laitue 4-saisons","4 cm","AL0900"]
["Eikenbladsla  - Laitue feuille de chêne","4 cm","AL0910"]
["Eikenbladsla groen -  Feuillle de chêne vert","4 cm","AL0920"]
["Romeinse  sla -  Laitue Romaine","4 cm","AL0930"]
["IJsberg sla  - Laitue iceberg","4 cm","AL0940"]
["Batavia rood  -  rouge","4 cm","AL0950"]
["Batavia groen  -  vert","4 cm","AL0960"]
["Veldsla - Mâches","4 cm","AL0970"]
["Spinazie - Épinards","4 cm","AL1000"]
["Winterbloemkool-Chou fleur d'hiver","4 cm","AL1120"]
["Vroege kool - Chou fleur primeur","8 cm","AL1135"]
["Vroege bloemkool - Chou fleur primeur Ø 10,5 cm","Ø 10,5 cm ","AL1080"]
["Winter Prei Pak - Poireau d'hiver botte (20x50)*","doos","AL1050"]
["Cherrytomaat - Tomate apéritif VRDR","Ø 19 cm","AL1290"]
["Paprika rood  -  Poivron rouge VRDR","Ø 19 cm","AL1300"]
["Peper rood - Piment rouge VRDR","Ø 19 cm","AL1320"]
["Peper geel - Piment jaune VRDR","Ø 19 cm","AL1330"]
["Snack komkommer - Concombre snack VRDR","Ø 19 cm","AL1340"]
["Peper 'Torito' rood - Piment rouge 'Torito' VRDR","Ø 19 cm","AL1350"]
["Snack paprika rood - poivron snack rouge VRDR","Ø 19 cm","AL1360"]
["Snack paprika oranje - poivron snack orange VRDR","Ø 19 cm","AL1370"]
["Snack paprika geel - poivron snack jaune VRDR","Ø 19 cm","AL1380"]
["Basilicum - Basilic 13 cm","Ø 13 cm","AL2200"]
["Basilicum rood - Basilic rouge 13 cm","Ø 13 cm","AL2205"]
["Basilicum Thaise - Basilic Thai 13 cm","Ø 13 cm","AL2210"]
["Bieslook - Ciboulette 13 cm","Ø 13 cm","AL2220"]
["Citroenverbena - Verveine Citronelle 13 cm","Ø 13 cm","AL2230"]
["Dragon - Estragon 13 cm","Ø 13 cm","AL2240"]
["Koriander - Coriandre 13 cm","Ø 13 cm","AL2250"]
["Marokkaanse Munt - Menthe Marocaine 13 cm","Ø 13 cm","AL2260"]
["Oregano - Origan 13 cm","Ø 13 cm","AL2270"]
["Peterselie - Persil 13 cm","Ø 13 cm","AL2280"]
["Bladpeterselie - Persil plat 13 cm","Ø 13 cm","AL2285"]
["Pluksla - Laitue à couper 13 cm","Ø 13 cm","AL2290"]
["Rozemarijn - Romarin 13 cm","Ø 13 cm","AL2300"]
["Rucola - Roquette 13 cm","Ø 13 cm","AL2310"]
["Salie - Sauge 13 cm","Ø 13 cm","AL2315"]
["Tijm - Thym 13 cm","Ø 13 cm","AL2320"]
["Tijm citroen - Thym citron 13 cm","Ø 13 cm","AL2325"]
["Kattegras - Herbe à chats 13cm","Ø 13 cm","AL2330"]
["Prei - Poireau 13cm","Ø 13 cm","AL2340"]
["Rabarber - Rhubarbe 13cm","Ø 13 cm","AL2350"]
["Zoete aardappel - Patate douce 13 cm","Ø 13 cm","AL2360"]
["Basilicum - Basilic 24 cm","deco Ø 24 cm","AL2380"]
["Munt - Menthe 24 cm","deco Ø 24 cm","AL2382"]
["Rozemarijn - Romarin 24 cm","deco Ø 24 cm","AL2384"]
["Tijm - Thym 24 cm","deco Ø 24 cm","AL2386"]
["BBQ mix 24 cm","deco Ø 24 cm","AL2388"]
["Pizza-Pasta mix 24 cm","deco Ø 24 cm","AL2392"]
["Provence mix 24cm","deco Ø 24 cm","AL2390"]
["Hangpot doordrager - Suspension remontant","Ø 23 cm","AL2550"]
["Hangpot Patio Pink - Suspension Patio pink","Ø 23 cm","AL2560"]
["Ostara lente - printemps","Ø 10,5 cm","AL2580"]
["Mara de bois lente - printemps","Ø 10,5 cm","AL2590"]
["Darselect lente - printemps","Ø 10,5 cm","AL2600"]
["Elsanta lente - printemps","Ø 10,5 cm","AL2610"]
["Gariguette lente - printemps","Ø 10,5 cm","AL2620"]
["Korona lente - printemps","Ø 10,5 cm","AL2630"]
["Lambada lente - printemps","Ø 10,5 cm","AL2640"]
["Senga Sengana lente - printemps","Ø 10,5 cm","AL2650"]
["Ostara zomer - été","Ø 10,5 cm","AL2720"]
["Darselect zomer - été","Ø 10,5 cm","AL2730"]
["Elsanta zomer - été","Ø 10,5 cm","AL2740"]
["Gariguette zomer - été","Ø 10,5 cm","AL2750"]
["Vima Xima zomer - été","Ø 10,5 cm","AL2760"]
["Ostara 13 cm ","Ø 13 cm","AL2660"]
["Elsanta 13 cm ","Ø 13 cm","AL2670"]
["Bosaardbei - Fraisier des bois 13 cm","Ø 13 cm","AL2680"]
["Patio Pink 13 cm","Ø 13 cm","AL2690"]
["Framboo 13 cm ","Ø 13 cm","AL2700"]
["Snow white 13cm","Ø 13 cm","AL2710"]